Comme annoncé, ce forum est passé en lecture seule au 1er janvier 2020. Désormais nous vous invitons à vous rendre sur notre nouvelle page communauté :
Image

A très bientôt !

[Plugin Tiers][Sujet Principal] Rflink : passerelle RF433 multi-protocoles

Pour échanger sur les plugins classés en catégorie "Protocoles domotiques"
patmtp35
Timide
Messages : 254
Inscription : 30 juil. 2014, 19:11

Re: [Sujet officiel] Rflink : passerelle RF433 multi-protoco

Message par patmtp35 » 16 déc. 2015, 14:27

je viens de rentrer j'ai pris un WD18 X10 RF je l'ai coller au RFlink qd je le réveille le rflink le capte pas donc de même pour mai ms13 et autre X10 RF

après verif en X10 ne marche que les inter, pas les détecteur, meme me télécommande KR21E ne sont pas reconnu.... vais pas encore arrté ma Zibase ou forcé...

pour info les prise coco par 3 marche tres bien meme la fonction all OFF

tous le matériel chacon est ok pour moi le hic c'est la porté avec les détecteurs d'ouverture, vais leur ajouter une anthène DIY
ESXi6 N54L => VM_Jeedom 3.2.11 + VM Xpenology 6.2
RFLINK USB + USB AeonTek Gen5 + USB Bluetooth + USB Teleinfo + XiaomiHome + 4 Ipcam
Imperihome Pro => AssusTAB 9"
Google Home Mini
SmartledMessenger
Rpi Musicman
Rpi SqueezePlayer

Deennoo
Timide
Messages : 450
Inscription : 05 nov. 2015, 13:51

Re: [Sujet officiel] Rflink : passerelle RF433 multi-protoco

Message par Deennoo » 16 déc. 2015, 19:39

vincecoco a écrit :Bonjour,
Pourriez vous me dire si les prises Home confort (ici http://www.amazon.fr/Home-confort-YC-40 ... B00IVIK8XW) vendu 22.9 chez leroy :D, sont compatibles ?
Je ne les ai pas vu en page 1.

Merci
Oui cela fonctionne j'en ai une 20ene

Avatar de l’utilisateur
Pierre.pp59
Timide
Messages : 77
Inscription : 20 juin 2015, 21:39
Localisation : Nord

Re: [Sujet officiel] Rflink : passerelle RF433 multi-protoco

Message par Pierre.pp59 » 16 déc. 2015, 22:26

vincecoco a écrit :Bonjour,
Pourriez vous me dire si les prises Home confort (ici http://www.amazon.fr/Home-confort-YC-40 ... B00IVIK8XW) vendu 22.9 chez leroy :D, sont compatibles ?
Je ne les ai pas vu en page 1.

Merci
Celle de Amazon fonctionnent avec RFLink et Arduidom chez moi
Jeedom v3.0.11 sur RPI3
Arduidom v24 sur ATmega2560
RFLink R39 sur ATmega2560
Sondes Homemade ATmega 328P/attiny 433/315MHz PT2262 et contacteurs low cost
IPcams, Prises, interrupteurs et commandes diverses
Tasker/Autovoice sur Tablette/Tel

Avatar de l’utilisateur
Wapata
Timide
Messages : 133
Inscription : 29 avr. 2015, 10:43
Localisation : 44 - Saint Nazaire - Herbignac

Re: [Sujet officiel] Rflink : passerelle RF433 multi-protoco

Message par Wapata » 17 déc. 2015, 09:15

Je sais pas si ça vous intéresse, mais y a un bonhomme qui montre comment sniffer le 433Mhz avec une carte son. En anglais, et dans le pdf.

Golgautier
Actif
Messages : 514
Inscription : 10 avr. 2015, 10:56

Re: [Sujet officiel] Rflink : passerelle RF433 multi-protoco

Message par Golgautier » 17 déc. 2015, 10:38

Bon ben j'ai pu tester hier, pas de réception du signal de ma télécommande LIVOLO par la R35. Je vais essayer de donner les infos à la team qui développe le sketch pour que ce soit intégré... J'espère que ça va le faire.
Jeedom en DIY
Plugins : Alarme, BBox TV, Energie, Google Agenda, Monitoring, Nabaztag, NetAtmo Station et Thermostat, Notify My Android, Pluie à 1h, PushBullet, Script, SMS, Surveillance Station, Vigilance Météo, Widget, Zwave
Liste du matériel

patmtp35
Timide
Messages : 254
Inscription : 30 juil. 2014, 19:11

Re: [Sujet officiel] Rflink : passerelle RF433 multi-protoco

Message par patmtp35 » 17 déc. 2015, 15:26

concernat le CM119 cela fait 3 jour maintenant que je laisse tourner je n'ai q'une ligne INFO pour le CM119 avec la commande KWATT , qq un a t il un cm119 ?
ESXi6 N54L => VM_Jeedom 3.2.11 + VM Xpenology 6.2
RFLINK USB + USB AeonTek Gen5 + USB Bluetooth + USB Teleinfo + XiaomiHome + 4 Ipcam
Imperihome Pro => AssusTAB 9"
Google Home Mini
SmartledMessenger
Rpi Musicman
Rpi SqueezePlayer

rol-rider
Actif
Messages : 5097
Inscription : 10 août 2014, 23:50

Re: [Sujet officiel] Rflink : passerelle RF433 multi-protoco

Message par rol-rider » 17 déc. 2015, 16:31

J'ai cette erreur dans les log nginx.error....ça me semble en rapport à RFLink ?
elle revient toutes les minutes ?
2015/12/17 16:22:54 [error] 481#0: *29842 FastCGI sent in stderr: "PHP message: PHP Notice: Undefined offset: 1 in /usr/share/nginx/www/jeedom/plugins/rflink/core/class/rflink.class.php on line 336" while reading response header from upstream, client: 192.168.0.5, server: , request: "PUT /core/api/jeeApi.php?api=xxxxxxxxxxxxx&messagetype=saveValue&type=rflink HTTP/1.1", upstream: "fastcgi://unix:/var/run/php5-fpm.sock:", host: "192.168.0.5:80"
RPI3 avec mSATA
RFXcom; RFLink; Z-Wave; Mysensors; ESPEasy
Noeuds MySensors-téléinfo-Température-Distance-Baromètre-relais
Noeuds ESPEasy-open-garage-relais-PIR-Station Météo

mx85
Timide
Messages : 52
Inscription : 31 août 2014, 23:40
Localisation : 85

Re: [Sujet officiel] Rflink : passerelle RF433 multi-protoco

Message par mx85 » 17 déc. 2015, 22:13

@lunarok le plugin permet il de communiquer avec le RF-Link en TCP ?
J'ai monté un esp-01 sur le RF-Link sur cet esp, j'ai flashé la version stable de https://github.com/jeelabs/esp-link . La communication fonctionne bien en TCP avec putty(telnet).
J'aimerai être sûr que la communication TCP soit prise en charge avant d'acheter le plugin.
Merci.
Jeedom sur Debian 9.1 (stretch) 64bits virtualisé VMWare ESXi
Raspberry
RFLink
MySensors : Gateway Ethernet (W5100), RF433, DHT22
Nabaztag:tag
bus 1wire avec sondes de température
ESPEasy
Xee Connect v1 et v2

Deennoo
Timide
Messages : 450
Inscription : 05 nov. 2015, 13:51

Re: [Sujet officiel] Rflink : passerelle RF433 multi-protoco

Message par Deennoo » 17 déc. 2015, 23:02

Je te conseil ce sketch plutôt :

https://github.com/dparnell/esp8266-ser2net

Il fonctionne chez moi depuis 3 mois maintenant.

@lunarock pour le plug ins prévoit une reconnection automatique si pas de réponse au ping ou si pas de donnée reçu depuis x seconde s

Avatar de l’utilisateur
lunarok
Actif
Messages : 6704
Inscription : 08 août 2014, 12:48
Localisation : Anjou

Re: [Sujet officiel] Rflink : passerelle RF433 multi-protoco

Message par lunarok » 17 déc. 2015, 23:32

Pas de prise en charge avec un esp. Pour une communication "TCP" y a le mode déporté.
Je me vois mal mettre en place le support wifi vu que la 2 postes, 2 sketchs. Si il faut se reconnecter régulièrement c'est que l'esp n'est pas correctement gère et pas toujours actif.
En gros comme les débuts de mysensors sur esp. A voir plus tard, mais la je suis sur la mise a jour v2 qui permet la notification de mise a jour dispose pour le firmware

Envoyé de mon A0001 en utilisant Tapatalk
Mon Blog | Xiaomi Home
Pour contribuer au développement des plugins (don ou achat de matériel) : Paypal
Aides nous à t'aider : les logs, détails du soucis, la doc, recherche sur le forum ...
PS : pas de support par MP, je ne répondrais pas

mx85
Timide
Messages : 52
Inscription : 31 août 2014, 23:40
Localisation : 85

Re: [Sujet officiel] Rflink : passerelle RF433 multi-protoco

Message par mx85 » 18 déc. 2015, 05:11

Deennoo a écrit :Je te conseil ce sketch plutôt :

https://github.com/dparnell/esp8266-ser2net

Il fonctionne chez moi depuis 3 mois maintenant.

@lunarock pour le plug ins prévoit une reconnection automatique si pas de réponse au ping ou si pas de donnée reçu depuis x seconde s
Tu l' utilises pour le rflink ?
Jeedom sur Debian 9.1 (stretch) 64bits virtualisé VMWare ESXi
Raspberry
RFLink
MySensors : Gateway Ethernet (W5100), RF433, DHT22
Nabaztag:tag
bus 1wire avec sondes de température
ESPEasy
Xee Connect v1 et v2

Deennoo
Timide
Messages : 450
Inscription : 05 nov. 2015, 13:51

Re: [Sujet officiel] Rflink : passerelle RF433 multi-protoco

Message par Deennoo » 18 déc. 2015, 07:04

Oui mais avec une autre application


Envoyé de mon iPhone en utilisant Tapatalk

kriss35
Timide
Messages : 128
Inscription : 17 juil. 2014, 13:33

Re: [Sujet officiel] Rflink : passerelle RF433 multi-protoco

Message par kriss35 » 18 déc. 2015, 07:53

lunarok a écrit :Pas de prise en charge avec un esp. Pour une communication "TCP" y a le mode déporté.
Je me vois mal mettre en place le support wifi vu que la 2 postes, 2 sketchs. Si il faut se reconnecter régulièrement c'est que l'esp n'est pas correctement gère et pas toujours actif.
En gros comme les débuts de mysensors sur esp. A voir plus tard, mais la je suis sur la mise a jour v2 qui permet la notification de mise a jour dispose pour le firmware

Envoyé de mon A0001 en utilisant Tapatalk
Hello Lunarok,

La reconnection peut être necessaire lorsque la ****box qui fait point d'accès reboot par exemple ;-)

Pour la connexion par le port serie, les createurs de RFLink ont intégré la fonction "10;PING;" pour s'assurer que le RFLink est toujours présent. Dans Domoticz un reboot est effectué je crois lorsqu'il n'y a pas de réponse. Y a quelque chose de similaire dans le plugin de Jeedom ?


Kriss

Antrax
Timide
Messages : 79
Inscription : 30 nov. 2015, 01:07

Re: [Sujet officiel] Rflink : passerelle RF433 multi-protoco

Message par Antrax » 18 déc. 2015, 16:23

yop

je viens de recevoir mon rflink.

mais impossible d'installer les dépendances via le plugin. j'ai un raspberry pi2 avec raspbian.


dans les logs j'avais un soucis avec npm, une fois npm installé j ai plein d erreur.
début de l'installtion
Reading package lists...
Building dependency tree...
Reading state information...
build-essential is already the newest version.
avrdude is already the newest version.
0 upgraded, 0 newly installed, 0 to remove and 0 not upgraded.
npm ERR! Error: ENOTEMPTY, rmdir '/root/.npm/registry.npmjs.org'
npm ERR! If you need help, you may report this *entire* log,
npm ERR! including the npm and node versions, at:
npm ERR!

npm ERR! System Linux 4.1.13-v7+
npm ERR! command "/usr/bin/nodejs" "/usr/bin/npm" "cache" "clean"
npm ERR! cwd /usr/share/nginx/www/jeedom/plugins/rflink/node
npm ERR! node -v v0.10.29
npm ERR! npm -v 1.4.21
npm ERR! path /root/.npm/registry.npmjs.org
npm ERR! code ENOTEMPTY
npm ERR! errno 53
npm ERR!
npm ERR! Additional logging details can be found in:
npm ERR! /usr/share/nginx/www/jeedom/plugins/rflink/node/npm-debug.log
npm ERR! not ok code 0
rm: cannot remove 'node_modules/request/node_modules/bl/node_modules/readable-stream': Directory not empty

> serialport@2.0.5 install /usr/share/nginx/www/jeedom/plugins/rflink/node/node_modules/serialport
> node-pre-gyp install --fallback-to-build

npm ERR! If you need help, you may report this *entire* log,
npm ERR! including the npm and node versions, at:
npm ERR!

npm ERR! System Linux 4.1.13-v7+
npm ERR! command "/usr/bin/nodejs" "/usr/bin/npm" "install" "--unsafe-perm" "request"
npm ERR! cwd /usr/share/nginx/www/jeedom/plugins/rflink/node
npm ERR! node -v v0.10.29
npm ERR! npm -v 1.4.21
npm ERR! path /usr/share/nginx/www/jeedom/plugins/rflink/node/node_modules/request/node_modules/tough-cookie/lib/pubsuffix.js
npm ERR! fstream_path /usr/share/nginx/www/jeedom/plugins/rflink/node/node_modules/request/node_modules/tough-cookie/lib/pubsuffix.js
npm ERR! fstream_type File
npm ERR! fstream_class FileWriter
npm ERR! code ENOENT
npm ERR! errno 34
npm ERR! fstream_stack /usr/lib/nodejs/fstream/lib/writer.js:284:26
npm ERR! fstream_stack Object.oncomplete (evalmachine.:107:15)
npm ERR! Error: ENOENT, lstat '/usr/share/nginx/www/jeedom/plugins/rflink/node/node_modules/request/node_modules/har-validator/node_modules/is-my-json-valid/test/misc.js'
npm ERR! If you need help, you may report this *entire* log,
npm ERR! including the npm and node versions, at:
npm ERR!

npm ERR! System Linux 4.1.13-v7+
npm ERR! command "/usr/bin/nodejs" "/usr/bin/npm" "install" "--unsafe-perm" "request"
npm ERR! cwd /usr/share/nginx/www/jeedom/plugins/rflink/node
npm ERR! node -v v0.10.29
npm ERR! npm -v 1.4.21
npm ERR! path /usr/share/nginx/www/jeedom/plugins/rflink/node/node_modules/request/node_modules/har-validator/node_modules/is-my-json-valid/test/misc.js
npm ERR! fstream_path /usr/share/nginx/www/jeedom/plugins/rflink/node/node_modules/request/node_modules/har-validator/node_modules/is-my-json-valid/test/misc.js
npm ERR! fstream_type File
npm ERR! fstream_class FileWriter
npm ERR! code ENOENT
npm ERR! errno 34
npm ERR! fstream_stack /usr/lib/nodejs/fstream/lib/writer.js:284:26
npm ERR! fstream_stack Object.oncomplete (evalmachine.:107:15)
npm ERR! Error: ENOENT, lstat '/usr/share/nginx/www/jeedom/plugins/rflink/node/node_modules/request/node_modules/mime-types/node_modules/mime-db/db.json'
npm ERR! If you need help, you may report this *entire* log,
npm ERR! including the npm and node versions, at:
npm ERR!

npm ERR! System Linux 4.1.13-v7+
npm ERR! command "/usr/bin/nodejs" "/usr/bin/npm" "install" "--unsafe-perm" "request"
npm ERR! cwd /usr/share/nginx/www/jeedom/plugins/rflink/node
npm ERR! node -v v0.10.29
npm ERR! npm -v 1.4.21
npm ERR! path /usr/share/nginx/www/jeedom/plugins/rflink/node/node_modules/request/node_modules/mime-types/node_modules/mime-db/db.json
npm ERR! fstream_path /usr/share/nginx/www/jeedom/plugins/rflink/node/node_modules/request/node_modules/mime-types/node_modules/mime-db/db.json
npm ERR! fstream_type File
npm ERR! fstream_class FileWriter
npm ERR! code ENOENT
npm ERR! errno 34
npm ERR! fstream_stack /usr/lib/nodejs/fstream/lib/writer.js:284:26
npm ERR! fstream_stack Object.oncomplete (evalmachine.:107:15)
npm ERR! Error: ENOENT, lstat '/usr/share/nginx/www/jeedom/plugins/rflink/node/node_modules/request/node_modules/form-data/node_modules/async/lib/async.js'
npm ERR! If you need help, you may report this *entire* log,
npm ERR! including the npm and node versions, at:
npm ERR!

npm ERR! System Linux 4.1.13-v7+
npm ERR! command "/usr/bin/nodejs" "/usr/bin/npm" "install" "--unsafe-perm" "request"
npm ERR! cwd /usr/share/nginx/www/jeedom/plugins/rflink/node
npm ERR! node -v v0.10.29
npm ERR! npm -v 1.4.21
npm ERR! path /usr/share/nginx/www/jeedom/plugins/rflink/node/node_modules/request/node_modules/form-data/node_modules/async/lib/async.js
npm ERR! fstream_path /usr/share/nginx/www/jeedom/plugins/rflink/node/node_modules/request/node_modules/form-data/node_modules/async/lib/async.js
npm ERR! fstream_type File
npm ERR! fstream_class FileWriter
npm ERR! code ENOENT
npm ERR! errno 34
npm ERR! fstream_stack /usr/lib/nodejs/fstream/lib/writer.js:284:26
npm ERR! fstream_stack Object.oncomplete (evalmachine.:107:15)
npm ERR! Error: ENOENT, lstat '/usr/share/nginx/www/jeedom/plugins/rflink/node/node_modules/request/node_modules/hawk/test/index.js'
npm ERR! If you need help, you may report this *entire* log,
npm ERR! including the npm and node versions, at:
npm ERR!

npm ERR! System Linux 4.1.13-v7+
npm ERR! command "/usr/bin/nodejs" "/usr/bin/npm" "install" "--unsafe-perm" "request"
npm ERR! cwd /usr/share/nginx/www/jeedom/plugins/rflink/node
npm ERR! node -v v0.10.29
npm ERR! npm -v 1.4.21
npm ERR! path /usr/share/nginx/www/jeedom/plugins/rflink/node/node_modules/request/node_modules/hawk/test/index.js
npm ERR! fstream_path /usr/share/nginx/www/jeedom/plugins/rflink/node/node_modules/request/node_modules/hawk/test/index.js
npm ERR! fstream_type File
npm ERR! fstream_class FileWriter
npm ERR! code ENOENT
npm ERR! errno 34
npm ERR! fstream_stack /usr/lib/nodejs/fstream/lib/writer.js:284:26
npm ERR! fstream_stack Object.oncomplete (evalmachine.:107:15)
npm ERR! Error: ENOENT, open '/usr/share/nginx/www/jeedom/plugins/rflink/node/node_modules/request/node_modules/bl/node_modules/readable-stream/package.json'
npm ERR! If you need help, you may report this *entire* log,
npm ERR! including the npm and node versions, at:
npm ERR!

npm ERR! System Linux 4.1.13-v7+
npm ERR! command "/usr/bin/nodejs" "/usr/bin/npm" "install" "--unsafe-perm" "request"
npm ERR! cwd /usr/share/nginx/www/jeedom/plugins/rflink/node
npm ERR! node -v v0.10.29
npm ERR! npm -v 1.4.21
npm ERR! path /usr/share/nginx/www/jeedom/plugins/rflink/node/node_modules/request/node_modules/bl/node_modules/readable-stream/package.json
npm ERR! code ENOENT
npm ERR! errno 34
make: Entering directory '/usr/share/nginx/www/jeedom/plugins/rflink/node/node_modules/serialport/build'
CXX(target) Release/obj.target/serialport/src/serialport.o
In file included from ../src/serialport.h:5:0,
from ../src/serialport.cpp:3:
../node_modules/nan/nan.h:316:47: error: 'REPLACE_INVALID_UTF8' is not a member of 'v8::String'
static const unsigned kReplaceInvalidUtf8 = v8::String::REPLACE_INVALID_UTF8;
^
serialport.target.mk:84: recipe for target 'Release/obj.target/serialport/src/serialport.o' failed
make: *** [Release/obj.target/serialport/src/serialport.o] Error 1
make: Leaving directory '/usr/share/nginx/www/jeedom/plugins/rflink/node/node_modules/serialport/build'
gyp ERR! build error
gyp ERR! stack Error: `make` failed with exit code: 2
gyp ERR! stack at ChildProcess.onExit (/usr/share/node-gyp/lib/build.js:267:23)
gyp ERR! stack at ChildProcess.emit (events.js:98:17)
gyp ERR! stack at Process.ChildProcess._handle.onexit (child_process.js:809:12)
gyp ERR! System Linux 4.1.13-v7+
gyp ERR! command "nodejs" "/usr/bin/node-gyp" "build" "--fallback-to-build" "--module=/usr/share/nginx/www/jeedom/plugins/rflink/node/node_modules/serialport/build/Release/node-v11-linux-arm/serialport.node" "--module_name=serialport" "--module_path=/usr/share/nginx/www/jeedom/plugins/rflink/node/node_modules/serialport/build/Release/node-v11-linux-arm"
gyp ERR! cwd /usr/share/nginx/www/jeedom/plugins/rflink/node/node_modules/serialport
gyp ERR! node -v v0.10.29
gyp ERR! node-gyp -v v0.12.2
gyp ERR! not ok
node-pre-gyp ERR! build error
node-pre-gyp ERR! stack Error: Failed to execute 'node-gyp build --fallback-to-build --module=/usr/share/nginx/www/jeedom/plugins/rflink/node/node_modules/serialport/build/Release/node-v11-linux-arm/serialport.node --module_name=serialport --module_path=/usr/share/nginx/www/jeedom/plugins/rflink/node/node_modules/serialport/build/Release/node-v11-linux-arm' (1)
node-pre-gyp ERR! stack at ChildProcess. (/usr/share/nginx/www/jeedom/plugins/rflink/node/node_modules/serialport/node_modules/node-pre-gyp/lib/util/compile.js:83:29)
node-pre-gyp ERR! stack at ChildProcess.emit (events.js:98:17)
node-pre-gyp ERR! stack at maybeClose (child_process.js:755:16)
node-pre-gyp ERR! stack at Process.ChildProcess._handle.onexit (child_process.js:822:5)
node-pre-gyp ERR! System Linux 4.1.13-v7+
node-pre-gyp ERR! command "node" "/usr/share/nginx/www/jeedom/plugins/rflink/node/node_modules/serialport/node_modules/.bin/node-pre-gyp" "install" "--fallback-to-build"
node-pre-gyp ERR! cwd /usr/share/nginx/www/jeedom/plugins/rflink/node/node_modules/serialport
node-pre-gyp ERR! node -v v0.10.29
node-pre-gyp ERR! node-pre-gyp -v v0.6.13
node-pre-gyp ERR! not ok
Failed to execute 'node-gyp build --fallback-to-build --module=/usr/share/nginx/www/jeedom/plugins/rflink/node/node_modules/serialport/build/Release/node-v11-linux-arm/serialport.node --module_name=serialport --module_path=/usr/share/nginx/www/jeedom/plugins/rflink/node/node_modules/serialport/build/Release/node-v11-linux-arm' (1)
npm WARN This failure might be due to the use of legacy binary "node"
npm WARN For further explanations, please read
/usr/share/doc/nodejs/README.Debian

npm ERR! serialport@2.0.5 install: `node-pre-gyp install --fallback-to-build`
npm ERR! Exit status 1
npm ERR!
npm ERR! Failed at the serialport@2.0.5 install script.
npm ERR! This is most likely a problem with the serialport package,
npm ERR! not with npm itself.
npm ERR! Tell the author that this fails on your system:
npm ERR! node-pre-gyp install --fallback-to-build
npm ERR! You can get their info via:
npm ERR! npm owner ls serialport
npm ERR! There is likely additional logging output above.

npm ERR! System Linux 4.1.13-v7+
npm ERR! command "/usr/bin/nodejs" "/usr/bin/npm" "install" "--unsafe-perm" "serialport"
npm ERR! cwd /usr/share/nginx/www/jeedom/plugins/rflink/node
npm ERR! node -v v0.10.29
npm ERR! npm -v 1.4.21
npm ERR! code ELIFECYCLE
npm ERR!
npm ERR! Additional logging details can be found in:
npm ERR! /usr/share/nginx/www/jeedom/plugins/rflink/node/npm-debug.log
npm ERR! not ok code 0
npm WARN engine hawk@3.1.2: wanted: {"node":">=0.10.32"} (current: {"node":"0.10.29","npm":"1.4.21"})

Golgautier
Actif
Messages : 514
Inscription : 10 avr. 2015, 10:56

Re: [Sujet officiel] Rflink : passerelle RF433 multi-protoco

Message par Golgautier » 18 déc. 2015, 16:29

je dirais bien que c'est un souci de version du nodejs.

peux tu lancer la commande find / -name "node*" -type f -exec {} -v \;

Merci :)
Jeedom en DIY
Plugins : Alarme, BBox TV, Energie, Google Agenda, Monitoring, Nabaztag, NetAtmo Station et Thermostat, Notify My Android, Pluie à 1h, PushBullet, Script, SMS, Surveillance Station, Vigilance Météo, Widget, Zwave
Liste du matériel

Antrax
Timide
Messages : 79
Inscription : 30 nov. 2015, 01:07

Re: [Sujet officiel] Rflink : passerelle RF433 multi-protoco

Message par Antrax » 18 déc. 2015, 16:46

oula j ai plein de permission non accordé

find: "/usr/share/nginx/www/jeedom/plugins/rflink/doc/images/node_ir2.png": Permission non accordée
find: "/usr/share/nginx/www/jeedom/plugins/rflink/doc/images/node_relay.png": Permission non accordée
find: "/usr/share/nginx/www/jeedom/plugins/rflink/doc/images/node_ir.png": Permission non accordée
find: "/usr/share/nginx/www/jeedom/plugins/rflink/doc/images/node_teleinfo.png": Permission non accordée
find: "/usr/share/nginx/www/jeedom/plugins/rflink/doc/images/node_feuille.png": Permission non accordée
find: "/usr/share/nginx/www/jeedom/plugins/rflink/doc/images/node_temp.png": Permission non accordée
/usr/share/nginx/www/jeedom/core/nodeJS/node_modules/socket.io/node_modules/engine.io/node_modules/debug/node.js: 2: /usr/share/nginx/www/jeedom/core/nodeJS/node_modules/socket.io/node_modules/engine.io/node_modules/debug/node.js: /bin: Permission denied
/usr/share/nginx/www/jeedom/core/nodeJS/node_modules/socket.io/node_modules/engine.io/node_modules/debug/node.js: 3: /usr/share/nginx/www/jeedom/core/nodeJS/node_modules/socket.io/node_modules/engine.io/node_modules/debug/node.js: install.sh: not found
/usr/share/nginx/www/jeedom/core/nodeJS/node_modules/socket.io/node_modules/engine.io/node_modules/debug/node.js: 4: /usr/share/nginx/www/jeedom/core/nodeJS/node_modules/socket.io/node_modules/engine.io/node_modules/debug/node.js: */: not found
/usr/share/nginx/www/jeedom/core/nodeJS/node_modules/socket.io/node_modules/engine.io/node_modules/debug/node.js: 6: /usr/share/nginx/www/jeedom/core/nodeJS/node_modules/socket.io/node_modules/engine.io/node_modules/debug/node.js: Syntax error: "(" unexpected
/usr/share/nginx/www/jeedom/core/nodeJS/node_modules/socket.io/node_modules/socket.io-client/node_modules/engine.io-client/node_modules/debug/node.js: 2: /usr/share/nginx/www/jeedom/core/nodeJS/node_modules/socket.io/node_modules/socket.io-client/node_modules/engine.io-client/node_modules/debug/node.js: /bin: Permission denied
/usr/share/nginx/www/jeedom/core/nodeJS/node_modules/socket.io/node_modules/socket.io-client/node_modules/engine.io-client/node_modules/debug/node.js: 3: /usr/share/nginx/www/jeedom/core/nodeJS/node_modules/socket.io/node_modules/socket.io-client/node_modules/engine.io-client/node_modules/debug/node.js: install.sh: not found
/usr/share/nginx/www/jeedom/core/nodeJS/node_modules/socket.io/node_modules/socket.io-client/node_modules/engine.io-client/node_modules/debug/node.js: 4: /usr/share/nginx/www/jeedom/core/nodeJS/node_modules/socket.io/node_modules/socket.io-client/node_modules/engine.io-client/node_modules/debug/node.js: */: not found
/usr/share/nginx/www/jeedom/core/nodeJS/node_modules/socket.io/node_modules/socket.io-client/node_modules/engine.io-client/node_modules/debug/node.js: 6: /usr/share/nginx/www/jeedom/core/nodeJS/node_modules/socket.io/node_modules/socket.io-client/node_modules/engine.io-client/node_modules/debug/node.js: Syntax error: "(" unexpected
/usr/share/nginx/www/jeedom/core/nodeJS/node_modules/socket.io/node_modules/socket.io-adapter/node_modules/debug/node.js: 2: /usr/share/nginx/www/jeedom/core/nodeJS/node_modules/socket.io/node_modules/socket.io-adapter/node_modules/debug/node.js: /bin: Permission denied
/usr/share/nginx/www/jeedom/core/nodeJS/node_modules/socket.io/node_modules/socket.io-adapter/node_modules/debug/node.js: 3: /usr/share/nginx/www/jeedom/core/nodeJS/node_modules/socket.io/node_modules/socket.io-adapter/node_modules/debug/node.js: install.sh: not found
/usr/share/nginx/www/jeedom/core/nodeJS/node_modules/socket.io/node_modules/socket.io-adapter/node_modules/debug/node.js: 4: /usr/share/nginx/www/jeedom/core/nodeJS/node_modules/socket.io/node_modules/socket.io-adapter/node_modules/debug/node.js: */: not found
/usr/share/nginx/www/jeedom/core/nodeJS/node_modules/socket.io/node_modules/socket.io-adapter/node_modules/debug/node.js: 6: /usr/share/nginx/www/jeedom/core/nodeJS/node_modules/socket.io/node_modules/socket.io-adapter/node_modules/debug/node.js: Syntax error: "(" unexpected
/usr/share/nginx/www/jeedom/core/nodeJS/node_modules/express/node_modules/mime/types/node.types: 5: /usr/share/nginx/www/jeedom/core/nodeJS/node_modules/express/node_modules/mime/types/node.types: application/x-chrome-extension: not found
/usr/share/nginx/www/jeedom/core/nodeJS/node_modules/express/node_modules/mime/types/node.types: 11: /usr/share/nginx/www/jeedom/core/nodeJS/node_modules/express/node_modules/mime/types/node.types: font/opentype: not found
/usr/share/nginx/www/jeedom/core/nodeJS/node_modules/express/node_modules/mime/types/node.types: 16: /usr/share/nginx/www/jeedom/core/nodeJS/node_modules/express/node_modules/mime/types/node.types: text/x-component: not found
/usr/share/nginx/www/jeedom/core/nodeJS/node_modules/express/node_modules/mime/types/node.types: 22: /usr/share/nginx/www/jeedom/core/nodeJS/node_modules/express/node_modules/mime/types/node.types: text/cache-manifest: not found
/usr/share/nginx/www/jeedom/core/nodeJS/node_modules/express/node_modules/mime/types/node.types: 27: /usr/share/nginx/www/jeedom/core/nodeJS/node_modules/express/node_modules/mime/types/node.types: application/octet-stream: not found
/usr/share/nginx/www/jeedom/core/nodeJS/node_modules/express/node_modules/mime/types/node.types: 32: /usr/share/nginx/www/jeedom/core/nodeJS/node_modules/express/node_modules/mime/types/node.types: application/mp4: not found
/usr/share/nginx/www/jeedom/core/nodeJS/node_modules/express/node_modules/mime/types/node.types: 33: /usr/share/nginx/www/jeedom/core/nodeJS/node_modules/express/node_modules/mime/types/node.types: audio/mp4: not found
/usr/share/nginx/www/jeedom/core/nodeJS/node_modules/express/node_modules/mime/types/node.types: 38: /usr/share/nginx/www/jeedom/core/nodeJS/node_modules/express/node_modules/mime/types/node.types: application/x-mpegURL: not found
/usr/share/nginx/www/jeedom/core/nodeJS/node_modules/express/node_modules/mime/types/node.types: 43: /usr/share/nginx/www/jeedom/core/nodeJS/node_modules/express/node_modules/mime/types/node.types: video/MP2T: not found
/usr/share/nginx/www/jeedom/core/nodeJS/node_modules/express/node_modules/debug/node.js: 2: /usr/share/nginx/www/jeedom/core/nodeJS/node_modules/express/node_modules/debug/node.js: /bin: Permission denied
/usr/share/nginx/www/jeedom/core/nodeJS/node_modules/express/node_modules/debug/node.js: 3: /usr/share/nginx/www/jeedom/core/nodeJS/node_modules/express/node_modules/debug/node.js: install.sh: not found
/usr/share/nginx/www/jeedom/core/nodeJS/node_modules/express/node_modules/debug/node.js: 4: /usr/share/nginx/www/jeedom/core/nodeJS/node_modules/express/node_modules/debug/node.js: */: not found
/usr/share/nginx/www/jeedom/core/nodeJS/node_modules/express/node_modules/debug/node.js: 6: /usr/share/nginx/www/jeedom/core/nodeJS/node_modules/express/node_modules/debug/node.js: Syntax error: "(" unexpected
/usr/share/nginx/www/jeedom/core/nodeJS/node_modules/express/node_modules/send/node_modules/mime/types/node.types: 5: /usr/share/nginx/www/jeedom/core/nodeJS/node_modules/express/node_modules/send/node_modules/mime/types/node.types: text/vtt: not found
/usr/share/nginx/www/jeedom/core/nodeJS/node_modules/express/node_modules/send/node_modules/mime/types/node.types: 11: /usr/share/nginx/www/jeedom/core/nodeJS/node_modules/express/node_modules/send/node_modules/mime/types/node.types: application/x-chrome-extension: not found
/usr/share/nginx/www/jeedom/core/nodeJS/node_modules/express/node_modules/send/node_modules/mime/types/node.types: 16: /usr/share/nginx/www/jeedom/core/nodeJS/node_modules/express/node_modules/send/node_modules/mime/types/node.types: text/x-component: not found
/usr/share/nginx/www/jeedom/core/nodeJS/node_modules/express/node_modules/send/node_modules/mime/types/node.types: 22: /usr/share/nginx/www/jeedom/core/nodeJS/node_modules/express/node_modules/send/node_modules/mime/types/node.types: text/cache-manifest: not found
/usr/share/nginx/www/jeedom/core/nodeJS/node_modules/express/node_modules/send/node_modules/mime/types/node.types: 27: /usr/share/nginx/www/jeedom/core/nodeJS/node_modules/express/node_modules/send/node_modules/mime/types/node.types: application/octet-stream: not found
/usr/share/nginx/www/jeedom/core/nodeJS/node_modules/express/node_modules/send/node_modules/mime/types/node.types: 32: /usr/share/nginx/www/jeedom/core/nodeJS/node_modules/express/node_modules/send/node_modules/mime/types/node.types: application/mp4: not found
/usr/share/nginx/www/jeedom/core/nodeJS/node_modules/express/node_modules/send/node_modules/mime/types/node.types: 33: /usr/share/nginx/www/jeedom/core/nodeJS/node_modules/express/node_modules/send/node_modules/mime/types/node.types: audio/mp4: not found
/usr/share/nginx/www/jeedom/core/nodeJS/node_modules/express/node_modules/send/node_modules/mime/types/node.types: 38: /usr/share/nginx/www/jeedom/core/nodeJS/node_modules/express/node_modules/send/node_modules/mime/types/node.types: video/MP2T: not found
/usr/share/nginx/www/jeedom/core/nodeJS/node_modules/express/node_modules/send/node_modules/mime/types/node.types: 44: /usr/share/nginx/www/jeedom/core/nodeJS/node_modules/express/node_modules/send/node_modules/mime/types/node.types: text/event-stream: not found
/usr/share/nginx/www/jeedom/core/nodeJS/node_modules/express/node_modules/send/node_modules/mime/types/node.types: 49: /usr/share/nginx/www/jeedom/core/nodeJS/node_modules/express/node_modules/send/node_modules/mime/types/node.types: application/x-web-app-manifest+json: not found
/usr/share/nginx/www/jeedom/core/nodeJS/node_modules/express/node_modules/send/node_modules/mime/types/node.types: 54: /usr/share/nginx/www/jeedom/core/nodeJS/node_modules/express/node_modules/send/node_modules/mime/types/node.types: text/x-lua: not found
/usr/share/nginx/www/jeedom/core/nodeJS/node_modules/express/node_modules/send/node_modules/mime/types/node.types: 55: /usr/share/nginx/www/jeedom/core/nodeJS/node_modules/express/node_modules/send/node_modules/mime/types/node.types: application/x-lua-bytecode: not found
/usr/share/nginx/www/jeedom/core/nodeJS/node_modules/express/node_modules/send/node_modules/mime/types/node.types: 60: /usr/share/nginx/www/jeedom/core/nodeJS/node_modules/express/node_modules/send/node_modules/mime/types/node.types: text/x-markdown: not found
/usr/share/nginx/www/jeedom/core/nodeJS/node_modules/express/node_modules/send/node_modules/mime/types/node.types: 65: /usr/share/nginx/www/jeedom/core/nodeJS/node_modules/express/node_modules/send/node_modules/mime/types/node.types: text/plain: not found
/usr/share/nginx/www/jeedom/core/nodeJS/node_modules/express/node_modules/send/node_modules/mime/types/node.types: 70: /usr/share/nginx/www/jeedom/core/nodeJS/node_modules/express/node_modules/send/node_modules/mime/types/node.types: application/dash+xml: not found
/usr/share/nginx/www/jeedom/core/nodeJS/node_modules/express/node_modules/send/node_modules/mime/types/node.types: 77: /usr/share/nginx/www/jeedom/core/nodeJS/node_modules/express/node_modules/send/node_modules/mime/types/node.types: font/opentype: not found
/usr/share/nginx/www/jeedom/core/class/nodejs.class.php: 1: /usr/share/nginx/www/jeedom/core/class/nodejs.class.php: cannot open ?php: No such file
/usr/share/nginx/www/jeedom/core/class/nodejs.class.php: 3: /usr/share/nginx/www/jeedom/core/class/nodejs.class.php: /bin: Permission denied
/usr/share/nginx/www/jeedom/core/class/nodejs.class.php: 4: /usr/share/nginx/www/jeedom/core/class/nodejs.class.php: install.sh: not found
/usr/share/nginx/www/jeedom/core/class/nodejs.class.php: 5: /usr/share/nginx/www/jeedom/core/class/nodejs.class.php: install.sh: not found
/usr/share/nginx/www/jeedom/core/class/nodejs.class.php: 6: /usr/share/nginx/www/jeedom/core/class/nodejs.class.php: install.sh: not found
/usr/share/nginx/www/jeedom/core/class/nodejs.class.php: 7: /usr/share/nginx/www/jeedom/core/class/nodejs.class.php: install.sh: not found
/usr/share/nginx/www/jeedom/core/class/nodejs.class.php: 8: /usr/share/nginx/www/jeedom/core/class/nodejs.class.php: Syntax error: word unexpected (expecting ")")


Stop Node-RED

Use node-red-start to start Node-RED again
Use sudo update-rc.d nodered defaults to autostart Node-RED at every boot

[ ok ] Stopping nodered (via systemctl): nodered.service.



Once Node-RED has started, point a browser at http://192.168.0.17:1880

To stop Node-RED use the command node-red-stop

[ ok ] Starting nodered (via systemctl): nodered.service.
tail: impossible d'ouvrir « /var/log/node-red.log » en lecture: Aucun fichier ou dossier de ce type
tail: aucun fichier restant
v0.10.29
find: "/var/lib/dpkg/info/node-async.md5sums": Permission non accordée
find: "/var/lib/dpkg/info/node-combined-stream.md5sums": Permission non accordée
find: "/var/lib/dpkg/info/node-node-uuid.list": Permission non accordée
find: "/var/lib/dpkg/info/node-mute-stream.md5sums": Permission non accordée
find: "/var/lib/dpkg/info/node-delayed-stream.list": Permission non accordée
find: "/var/lib/dpkg/info/node-ini.md5sums": Permission non accordée
find: "/var/lib/dpkg/info/nodejs-legacy.list": Permission non accordée
find: "/var/lib/dpkg/info/node-graceful-fs.md5sums": Permission non accordée
find: "/var/lib/dpkg/info/node-sigmund.list": Permission non accordée
find: "/var/lib/dpkg/info/node-fstream-ignore.md5sums": Permission non accordée
find: "/var/lib/dpkg/info/node-once.list": Permission non accordée
find: "/var/lib/dpkg/info/node-mkdirp.md5sums": Permission non accordée
find: "/var/lib/dpkg/info/node-forever-agent.list": Permission non accordée
find: "/var/lib/dpkg/info/node-read-package-json.list": Permission non accordée
find: "/var/lib/dpkg/info/nodejs-legacy.md5sums": Permission non accordée
find: "/var/lib/dpkg/info/node-ansi.list": Permission non accordée
find: "/var/lib/dpkg/info/node-which.md5sums": Permission non accordée
find: "/var/lib/dpkg/info/node-osenv.md5sums": Permission non accordée
find: "/var/lib/dpkg/info/node-read.md5sums": Permission non accordée
find: "/var/lib/dpkg/info/node-mkdirp.list": Permission non accordée
find: "/var/lib/dpkg/info/node-tunnel-agent.list": Permission non accordée
find: "/var/lib/dpkg/info/node-read-package-json.md5sums": Permission non accordée
find: "/var/lib/dpkg/info/node-semver.md5sums": Permission non accordée
find: "/var/lib/dpkg/info/node-cookie-jar.list": Permission non accordée
find: "/var/lib/dpkg/info/node-lru-cache.list": Permission non accordée
find: "/var/lib/dpkg/info/node-request.md5sums": Permission non accordée
find: "/var/lib/dpkg/info/node-mime.list": Permission non accordée
find: "/var/lib/dpkg/info/node-retry.list": Permission non accordée
find: "/var/lib/dpkg/info/nodered.list": Permission non accordée
find: "/var/lib/dpkg/info/node-fstream-ignore.list": Permission non accordée
find: "/var/lib/dpkg/info/node-nopt.md5sums": Permission non accordée
find: "/var/lib/dpkg/info/node-block-stream.list": Permission non accordée
find: "/var/lib/dpkg/info/node-lockfile.md5sums": Permission non accordée
find: "/var/lib/dpkg/info/node-underscore.md5sums": Permission non accordée
find: "/var/lib/dpkg/info/node-slide.list": Permission non accordée
find: "/var/lib/dpkg/info/node-block-stream.md5sums": Permission non accordée
find: "/var/lib/dpkg/info/node-inherits.md5sums": Permission non accordée
find: "/var/lib/dpkg/info/node-graceful-fs.list": Permission non accordée
find: "/var/lib/dpkg/info/node-normalize-package-data.md5sums": Permission non accordée
find: "/var/lib/dpkg/info/node-mute-stream.list": Permission non accordée
find: "/var/lib/dpkg/info/nodered.md5sums": Permission non accordée
find: "/var/lib/dpkg/info/node-npmlog.md5sums": Permission non accordée
find: "/var/lib/dpkg/info/node-normalize-package-data.list": Permission non accordée
find: "/var/lib/dpkg/info/node-ansi.md5sums": Permission non accordée
find: "/var/lib/dpkg/info/node-minimatch.md5sums": Permission non accordée
find: "/var/lib/dpkg/info/nodejs-dev.list": Permission non accordée
find: "/var/lib/dpkg/info/node-async.list": Permission non accordée
find: "/var/lib/dpkg/info/node-tar.md5sums": Permission non accordée
find: "/var/lib/dpkg/info/node-form-data.list": Permission non accordée
find: "/var/lib/dpkg/info/node-archy.list": Permission non accordée
find: "/var/lib/dpkg/info/node-delayed-stream.md5sums": Permission non accordée
find: "/var/lib/dpkg/info/node-semver.list": Permission non accordée
find: "/var/lib/dpkg/info/node-abbrev.list": Permission non accordée
find: "/var/lib/dpkg/info/node-retry.md5sums": Permission non accordée
find: "/var/lib/dpkg/info/node-json-stringify-safe.list": Permission non accordée
find: "/var/lib/dpkg/info/node-which.list": Permission non accordée
find: "/var/lib/dpkg/info/node-forever-agent.md5sums": Permission non accordée
find: "/var/lib/dpkg/info/node-node-uuid.md5sums": Permission non accordée
find: "/var/lib/dpkg/info/node-sha.list": Permission non accordée
find: "/var/lib/dpkg/info/node-ini.list": Permission non accordée
find: "/var/lib/dpkg/info/node-glob.md5sums": Permission non accordée
find: "/var/lib/dpkg/info/node-abbrev.md5sums": Permission non accordée
find: "/var/lib/dpkg/info/node-slide.md5sums": Permission non accordée
find: "/var/lib/dpkg/info/node-rimraf.list": Permission non accordée
find: "/var/lib/dpkg/info/nodejs.list": Permission non accordée
find: "/var/lib/dpkg/info/node-rimraf.md5sums": Permission non accordée
find: "/var/lib/dpkg/info/node-fstream.list": Permission non accordée
find: "/var/lib/dpkg/info/nodejs-dev.md5sums": Permission non accordée
find: "/var/lib/dpkg/info/node-lru-cache.md5sums": Permission non accordée
find: "/var/lib/dpkg/info/node-mime.md5sums": Permission non accordée
find: "/var/lib/dpkg/info/node-qs.md5sums": Permission non accordée
find: "/var/lib/dpkg/info/node-form-data.md5sums": Permission non accordée
find: "/var/lib/dpkg/info/node-glob.list": Permission non accordée
find: "/var/lib/dpkg/info/node-underscore.list": Permission non accordée
find: "/var/lib/dpkg/info/node-nopt.list": Permission non accordée
find: "/var/lib/dpkg/info/node-ansi-color-table.md5sums": Permission non accordée
find: "/var/lib/dpkg/info/nodejs.md5sums": Permission non accordée
find: "/var/lib/dpkg/info/node-fstream.md5sums": Permission non accordée
find: "/var/lib/dpkg/info/node-npmlog.list": Permission non accordée
find: "/var/lib/dpkg/info/node-tar.list": Permission non accordée
find: "/var/lib/dpkg/info/node-json-stringify-safe.md5sums": Permission non accordée
find: "/var/lib/dpkg/info/node-github-url-from-git.md5sums": Permission non accordée
find: "/var/lib/dpkg/info/node-combined-stream.list": Permission non accordée
find: "/var/lib/dpkg/info/node-sha.md5sums": Permission non accordée
find: "/var/lib/dpkg/info/node-read.list": Permission non accordée
find: "/var/lib/dpkg/info/node-gyp.list": Permission non accordée
find: "/var/lib/dpkg/info/node-cookie-jar.md5sums": Permission non accordée
find: "/var/lib/dpkg/info/node-osenv.list": Permission non accordée
find: "/var/lib/dpkg/info/node-request.list": Permission non accordée
find: "/var/lib/dpkg/info/node-minimatch.list": Permission non accordée
find: "/var/lib/dpkg/info/node-gyp.md5sums": Permission non accordée
find: "/var/lib/dpkg/info/node-lockfile.list": Permission non accordée
find: "/var/lib/dpkg/info/node-qs.list": Permission non accordée
find: "/var/lib/dpkg/info/node-sigmund.md5sums": Permission non accordée
find: "/var/lib/dpkg/info/node-archy.md5sums": Permission non accordée
find: "/var/lib/dpkg/info/node-tunnel-agent.md5sums": Permission non accordée
find: "/var/lib/dpkg/info/node-once.md5sums": Permission non accordée
find: "/var/lib/dpkg/info/node-inherits.list": Permission non accordée
find: "/var/lib/dpkg/info/node-ansi-color-table.list": Permission non accordée
find: "/var/lib/dpkg/info/node-github-url-from-git.list": Permission non accordée
find: "/var/cache/apt/archives/node-npmlog_0.0.4-1_all.deb": Permission non accordée
find: "/var/cache/apt/archives/node-forever-agent_0.5.1-1_all.deb": Permission non accordée
find: "/var/cache/apt/archives/node-ansi-color-table_1.0.0-1_all.deb": Permission non accordée
find: "/var/cache/apt/archives/node-json-stringify-safe_5.0.0-1_all.deb": Permission non accordée
find: "/var/cache/apt/archives/node-which_1.0.5-2_all.deb": Permission non accordée
find: "/var/cache/apt/archives/node-sha_1.2.3-1_all.deb": Permission non accordée
find: "/var/cache/apt/archives/node-semver_2.1.0-2_all.deb": Permission non accordée
find: "/var/cache/apt/archives/node-once_1.1.1-1_all.deb": Permission non accordée
find: "/var/cache/apt/archives/node-abbrev_1.0.5-2_all.deb": Permission non accordée
find: "/var/cache/apt/archives/node-mkdirp_0.5.0-1_all.deb": Permission non accordée
find: "/var/cache/apt/archives/node-form-data_0.1.0-1_all.deb": Permission non accordée
find: "/var/cache/apt/archives/node-nopt_3.0.1-1_all.deb": Permission non accordée
find: "/var/cache/apt/archives/node-ini_1.1.0-1_all.deb": Permission non accordée
find: "/var/cache/apt/archives/node-async_0.8.0-1_all.deb": Permission non accordée
find: "/var/cache/apt/archives/node-gyp_0.12.2+ds-1_all.deb": Permission non accordée
find: "/var/cache/apt/archives/node-combined-stream_0.0.5-1_all.deb": Permission non accordée
find: "/var/cache/apt/archives/node-rimraf_2.2.8-1_all.deb": Permission non accordée
find: "/var/cache/apt/archives/node-archy_0.0.2-1_all.deb": Permission non accordée
find: "/var/cache/apt/archives/node-retry_0.6.0-1_all.deb": Permission non accordée
find: "/var/cache/apt/archives/node-normalize-package-data_0.2.2-1_all.deb": Permission non accordée
find: "/var/cache/apt/archives/nodejs-dev_0.10.29~dfsg-2_armhf.deb": Permission non accordée
find: "/var/cache/apt/archives/node-read_1.0.5-1_all.deb": Permission non accordée
find: "/var/cache/apt/archives/node-tar_0.1.18-1_all.deb": Permission non accordée
find: "/var/cache/apt/archives/node-minimatch_1.0.0-1_all.deb": Permission non accordée
find: "/var/cache/apt/archives/node-tunnel-agent_0.3.1-1_all.deb": Permission non accordée
find: "/var/cache/apt/archives/node-github-url-from-git_1.1.1-1_all.deb": Permission non accordée
find: "/var/cache/apt/archives/node-inherits_2.0.1-1_all.deb": Permission non accordée
find: "/var/cache/apt/archives/node-fstream-ignore_0.0.6-2_all.deb": Permission non accordée
find: "/var/cache/apt/archives/node-read-package-json_1.2.4-1_all.deb": Permission non accordée
find: "/var/cache/apt/archives/node-lru-cache_2.3.1-1_all.deb": Permission non accordée
find: "/var/cache/apt/archives/node-fstream_0.1.24-1_all.deb": Permission non accordée
find: "/var/cache/apt/archives/node-sigmund_1.0.0-1_all.deb": Permission non accordée
find: "/var/cache/apt/archives/node-cookie-jar_0.3.1-1_all.deb": Permission non accordée
find: "/var/cache/apt/archives/node-node-uuid_1.4.0-1_all.deb": Permission non accordée
find: "/var/cache/apt/archives/node-osenv_0.1.0-1_all.deb": Permission non accordée
find: "/var/cache/apt/archives/node-mime_1.2.11-1_all.deb": Permission non accordée
find: "/var/cache/apt/archives/node-lockfile_0.4.1-1_all.deb": Permission non accordée
find: "/var/cache/apt/archives/node-graceful-fs_3.0.2-1_all.deb": Permission non accordée
find: "/var/cache/apt/archives/node-mute-stream_0.0.4-1_all.deb": Permission non accordée
find: "/var/cache/apt/archives/node-glob_4.0.5-1_all.deb": Permission non accordée
find: "/var/cache/apt/archives/node-slide_1.1.4-1_all.deb": Permission non accordée
find: "/var/cache/apt/archives/node-request_2.26.1-1_all.deb": Permission non accordée
find: "/var/cache/apt/archives/node-block-stream_0.0.7-1_all.deb": Permission non accordée
find: "/var/cache/apt/archives/node-qs_2.2.4-1_all.deb": Permission non accordée
find: "/var/cache/apt/archives/node-underscore_1.7.0~dfsg-1_all.deb": Permission non accordée
find: "/var/cache/apt/archives/node-ansi_0.3.0-2_all.deb": Permission non accordée
find: "/var/cache/apt/archives/node-delayed-stream_0.0.5-1_all.deb": Permission non accordée
find: "/run/systemd/generator.late/nodered.service": Permission non accordée
Usage: /etc/init.d/nodered {start|stop|restart}
root@raspberrypi:~#

Antrax
Timide
Messages : 79
Inscription : 30 nov. 2015, 01:07

Re: [Sujet officiel] Rflink : passerelle RF433 multi-protoco

Message par Antrax » 18 déc. 2015, 16:50

selon Jeedom je suis en node js 1.212.0

Avatar de l’utilisateur
lunarok
Actif
Messages : 6704
Inscription : 08 août 2014, 12:48
Localisation : Anjou

Re: [Sujet officiel] Rflink : passerelle RF433 multi-protoco

Message par lunarok » 18 déc. 2015, 16:52

Non ça c'est la version jeedom
La t'as un nodejs non correct, c'est pas une image pi c'est une installé a la main ?

Envoyé de mon A0001 en utilisant Tapatalk
Mon Blog | Xiaomi Home
Pour contribuer au développement des plugins (don ou achat de matériel) : Paypal
Aides nous à t'aider : les logs, détails du soucis, la doc, recherche sur le forum ...
PS : pas de support par MP, je ne répondrais pas

Antrax
Timide
Messages : 79
Inscription : 30 nov. 2015, 01:07

Re: [Sujet officiel] Rflink : passerelle RF433 multi-protoco

Message par Antrax » 18 déc. 2015, 16:53

oui c'est une raspbian, je vais lancer un apt-get update puis un apt-get upgrade

Golgautier
Actif
Messages : 514
Inscription : 10 avr. 2015, 10:56

Re: [Sujet officiel] Rflink : passerelle RF433 multi-protoco

Message par Golgautier » 18 déc. 2015, 16:56

A priori t'est en nodejs v0.10.29? J'avais le même souci, c'est celui fourni par apt-get.

Les access-denied c'est normal, ma commande était un peu large.

Par contre, as tu un fichier /usr/local/bin/node ?

MErci.
Jeedom en DIY
Plugins : Alarme, BBox TV, Energie, Google Agenda, Monitoring, Nabaztag, NetAtmo Station et Thermostat, Notify My Android, Pluie à 1h, PushBullet, Script, SMS, Surveillance Station, Vigilance Météo, Widget, Zwave
Liste du matériel

Répondre

Revenir vers « [Catégorie] Protocoles domotiques »

Qui est en ligne ?

Utilisateurs parcourant ce forum : Aucun utilisateur inscrit et 3 invités