Comme annoncé, ce forum est passé en lecture seule au 1er janvier 2020. Désormais nous vous invitons à vous rendre sur notre nouvelle page communauté :
Image

A très bientôt !

Plugin blea

Avatar de l’utilisateur
Sabato
Timide
Messages : 291
Inscription : 23 janv. 2017, 11:25

Re: Plugin blea

Message par Sabato » 25 mars 2018, 08:07

Idem de 3 heures à 4 heures du matin mes nuts n'ont fait que changer d'état.
Rien dans les logs. (je n'étais pas en debug :roll: )
Vive la domotique mdr !! Allez bonne nuit !!
Une nouvelle anecdote de domotique à raconter :D
Jeedom SMART zwave avec :
- 3xFibaro FGR222, 1xFGK-101, 1xFGMS-001-ZW5, 1xFGS-213
- Broadlink RM PRO
- Nest
- 4xDash button
- Gateway Xiaomi 3 sondes de T°,1 capteur d'ouverture
- 3xBandeau led yeelight xiaomi
- 2xNut Find3
- 1xGH et 3xmini

Djal94
Actif
Messages : 1228
Inscription : 09 août 2016, 09:21

Re: Plugin blea

Message par Djal94 » 25 mars 2018, 08:20

Pareil ici, affolement des NUT a 3h du matin ...
Jeedom 3.2.11 sur NUC Intel (Debian 8)
Zwave - BLEA - Wifi
Trucs et Astuces

Avatar de l’utilisateur
Fabrice
Modérateur
Messages : 3424
Inscription : 27 oct. 2016, 22:26
Localisation : Planète terre, IDF, 93

Re: Plugin blea

Message par Fabrice » 25 mars 2018, 08:48

Pour la petite histoire, l'an passé... même heure, même problème !

Du coup, l'an passé, j'ai créé un mode qui désactive tout ce qui est lié à la présence / absence des NUT.
- Mais.... j'ai fait confiance à l'expérience de l'an passé, je n'ai pas basculé ce mode ;-) (du fait qu'a l'automne le problème ne s'est pas produit).

Pour ceux qui ont supprimé les piles des NUT, il était bien plus simple de désactiver le plugin BLEA.
Helper Officiel Jeedom
- Jeedom : 3.3.36
- Protocole : Z-Wave / RFXcom / BLEA
- Raspberry Pi : Pi 3 B+ / Pi 3 B / Pi Zero W

Avatar de l’utilisateur
kris1208
Actif
Messages : 661
Inscription : 18 juin 2015, 15:53
Contact :

Re: Plugin blea

Message par kris1208 » 25 mars 2018, 10:12

Oui comme parfois mon antenne qui est sur un NAS bug lors d'une mise a jour (c'est rare mais ca arrive) j'ai cree un virtuel pour desactiver le plugin et ca marche tres bien, c'est aussi ce que j'ai du faire cette nuit.
Je reactive ce matin en esperant que ce n'etait que provisoire.
Merci de m'avoir rassuré que je n'etais pas le seul.

i-magin
Actif
Messages : 987
Inscription : 18 août 2015, 10:23
Localisation : Villeurbanne

Re: Plugin blea

Message par i-magin » 25 mars 2018, 11:20

Bonjour

Çà été la "fête" aussi pour moi, à partir de 3H03 (2H03 à l'horaire d'hiver)

J'ai un scénario qui traite les éventuels "faux positifs" NUT
Ceux-ci sont devenus très rares depuis l'utilisation d'une clé Bluetooth Sena ud-100
Le principe étant que lorsque nos deux NUT ne sont plus détectés, je vérifie que la porte a été ouverte depuis un certain délai.
Si ce n'est pas le cas, j'envoie un message ask avec le plugin télégram

J'ai donc eu toutes les 2 à 5 mn un message Telegram dès 3H03 (2H03) :(
A moitié réveillé, j'ai désactivé le scénario et j'ai pu constater sur mon dashboard que les deux NUT passaient en hors ligne et immédiatement en ligne

L'historique montre que la dernière détection de mes 2 NUT est intervenue et stabilisée à 3H57

Il aura donc fallu une heure pour retrouver la stabilité...... il parait évident que le changement automatique d'horaire est la cause de cette petite "fête"
Jeedom RC V4.0.23
* DIY NUC 6I5SYK (Crucial 16GB Kit (8GBx2) DDR4 2133 MT/s) * Contrôleur Z-Wave AEOTEC GEN5 *
* VMWare ESXi 6.7.0 Update 3 (Build 14320388) * VM Jeedom Debian 9.5 avec 1 CPU/4 Go de mémoire * PHP 7.0.30-0 * Clé USB : SENA UD100

Shaad
Timide
Messages : 187
Inscription : 10 juin 2017, 11:14

Re: Plugin blea

Message par Shaad » 25 mars 2018, 11:52

Exactement pareil pour ma part.
Entre 03H02 et 03H57, tous mes devices BLEA ont clignoté non-stop, et les scénarios liés à la présence, la lumière & co se sont affolés ! Ma fille a pleuré car la veilleuse de sa chambre clignotait, ma copine a gueulé... je me suis levé, j'ai désactivé la gestion des modes liés aux NUT et les erreurs d'absence de mes thermomètres BLEA pour le plugin thermostat et me suis recouché.
Ce matin j'ai tout réactivé, aucun soucis.

Avatar de l’utilisateur
Theduck38
Helper
Messages : 2714
Inscription : 22 févr. 2015, 17:32
Localisation : Près de Grenoble
Contact :

Re: Plugin blea

Message par Theduck38 » 25 mars 2018, 12:25

Mouarf, je m'étais fait avoir l'année dernière :lol: :lol: :lol:
viewtopic.php?f=157&t=22289&start=1440#p454822
Réveillé à 2h(3h) par les annonces vocales en boucle ('Attention, activation des sécurités dans 30s...'), j'avais dû débrancher les RPi du multiroom.

Depuis j'ai mis une commande 'Armé' sur chaque NUT pour la gestion dans le scénario. Si le trigger qui lance le scénario est le nut et qu'il est désarmé, je ne fais rien.
J'ai aussi mis en place sur les conseils d'un autre Jeedomien (@tsim79) la désactivation des équipements SqueezePlayers à 21h30 (et réactivation à 7h) pour éviter les blagues....
Hier soir j'avais désarmé tous les NUTs avant d'aller me coucher... :mrgreen:
-- TD38 --
Helper Officiel Jeedom
Zimeteo sur Jeedom : http://www.meteo.lecoin.info
Jeedom Stable sur serveur custom
Le risque électrique - Afficheur leds RGB - Tablette Murale - Thermostat connecté

i-magin
Actif
Messages : 987
Inscription : 18 août 2015, 10:23
Localisation : Villeurbanne

Re: Plugin blea

Message par i-magin » 25 mars 2018, 13:23

Pour info, j'ai ouvert un ticket sur cet incident, s'il est possible d'y remédier pour le prochain changement d'horaire
Jeedom RC V4.0.23
* DIY NUC 6I5SYK (Crucial 16GB Kit (8GBx2) DDR4 2133 MT/s) * Contrôleur Z-Wave AEOTEC GEN5 *
* VMWare ESXi 6.7.0 Update 3 (Build 14320388) * VM Jeedom Debian 9.5 avec 1 CPU/4 Go de mémoire * PHP 7.0.30-0 * Clé USB : SENA UD100

AlainM
Actif
Messages : 1036
Inscription : 20 mars 2016, 14:21
Localisation : Hérault

Re: Plugin blea

Message par AlainM » 27 mars 2018, 22:08

Bonsoir,
Je persiste à dire que je perds tous mes équipements environ tous les 2 à 3 jours. Je suis obligé de relancer BLEA et tout refonctionne. Je n'avais aucun problème jusqu'ici.
Avez-vous une piste, des logs précis que je pourrais démarrer pour la prochaine panne?
Je suis sur RPI2 classique avec SD de qualité (du moins je le pense) Pas d'autres soucis ailleurs.
Merci pour votre aide

bertrandF
Timide
Messages : 63
Inscription : 23 déc. 2015, 14:50

Re: Plugin blea

Message par bertrandF » 28 mars 2018, 09:39

Bonjour,

Je suis sur Jeedom Smart et depuis la dernière MAJ du plugin BLEA, l'installation des dépendances échoue :
Mes logs :

Code : Tout sélectionner


Launch install of blea dependancy
Ign http://repo.jeedom.com ./ InRelease
Hit http://security.debian.org jessie/updates InRelease
Ign http://ftp.debian.org jessie InRelease
Ign http://repo.jeedom.com ./ Release.gpg
Hit http://ftp.debian.org jessie-updates InRelease
Hit http://repo.jeedom.com ./ Release
Hit http://ftp.debian.org jessie-backports InRelease
Ign http://repo.jeedom.com ./ Packages/DiffIndex
Hit http://ftp.debian.org jessie-proposed-updates InRelease
Hit http://ftp.debian.org jessie Release.gpg
Hit http://ftp.debian.org jessie Release
Hit http://security.debian.org jessie/updates/main Sources
Hit http://security.debian.org jessie/updates/contrib Sources
Hit http://ftp.debian.org jessie-updates/main Sources
Hit http://security.debian.org jessie/updates/non-free Sources
Hit http://ftp.debian.org jessie-updates/contrib Sources
Hit http://ftp.debian.org jessie-updates/non-free Sources
Hit http://security.debian.org jessie/updates/main arm64 Packages
Hit http://repo.jeedom.com ./ Packages
Get:1 http://ftp.debian.org jessie-updates/main arm64 Packages/DiffIndex [10.9 kB]
Hit http://security.debian.org jessie/updates/contrib arm64 Packages
Ign http://repo.jeedom.com ./ Translation-en
Hit http://ftp.debian.org jessie-updates/contrib arm64 Packages
Hit http://security.debian.org jessie/updates/non-free arm64 Packages
Get:2 http://ftp.debian.org jessie-updates/non-free arm64 Packages/DiffIndex [736 B]
Hit http://security.debian.org jessie/updates/contrib Translation-en
Hit http://ftp.debian.org jessie-updates/contrib Translation-en
Hit http://security.debian.org jessie/updates/main Translation-en
Get:3 http://ftp.debian.org jessie-updates/main Translation-en/DiffIndex [3688 B]
Hit http://security.debian.org jessie/updates/non-free Translation-en
Get:4 http://ftp.debian.org jessie-updates/non-free Translation-en/DiffIndex [736 B]
Hit http://oph.mdrjr.net all InRelease
Get:5 http://ftp.debian.org jessie-backports/main Sources/DiffIndex [27.8 kB]
Hit http://oph.mdrjr.net jessie InRelease
Get:6 http://ftp.debian.org jessie-backports/contrib Sources/DiffIndex [27.8 kB]
Get:7 http://ftp.debian.org jessie-backports/non-free Sources/DiffIndex [25.3 kB]
Get:8 http://ftp.debian.org jessie-backports/main arm64 Packages/DiffIndex [27.8 kB]
Get:9 http://ftp.debian.org jessie-backports/contrib arm64 Packages/DiffIndex [22.9 kB]
Get:10 http://ftp.debian.org jessie-backports/non-free arm64 Packages/DiffIndex [8530 B]
Hit http://oph.mdrjr.net all/c2 arm64 Packages
Get:11 http://ftp.debian.org jessie-backports/contrib Translation-en/DiffIndex [7960 B]
Hit http://oph.mdrjr.net all/main arm64 Packages
Get:12 http://ftp.debian.org jessie-backports/main Translation-en/DiffIndex [27.8 kB]
Hit http://oph.mdrjr.net all/testing arm64 Packages
Get:13 http://ftp.debian.org jessie-backports/non-free Translation-en/DiffIndex [18.2 kB]
Get:14 http://ftp.debian.org jessie-proposed-updates/contrib Sources/DiffIndex [7762 B]
Get:15 http://ftp.debian.org jessie-proposed-updates/non-free Sources/DiffIndex [15.1 kB]
Get:16 http://oph.mdrjr.net all/c2 Translation-en [321 B]
Get:17 http://ftp.debian.org jessie-proposed-updates/main Sources/DiffIndex [27.8 kB]
Get:18 http://oph.mdrjr.net all/main Translation-en [323 B]
Get:19 http://ftp.debian.org jessie-proposed-updates/contrib arm64 Packages/DiffIndex [4948 B]
Get:20 http://ftp.debian.org jessie-proposed-updates/non-free arm64 Packages/DiffIndex [7270 B]
Get:21 http://oph.mdrjr.net all/testing Translation-en [326 B]
Get:22 http://ftp.debian.org jessie-proposed-updates/main arm64 Packages/DiffIndex [27.8 kB]
Hit http://oph.mdrjr.net jessie/backports arm64 Packages
Get:23 http://ftp.debian.org jessie-proposed-updates/contrib Translation-en/DiffIndex [8392 B]
Get:24 http://ftp.debian.org jessie-proposed-updates/main Translation-en/DiffIndex [27.8 kB]
Hit http://oph.mdrjr.net jessie/main arm64 Packages
Get:25 http://ftp.debian.org jessie-proposed-updates/non-free Translation-en/DiffIndex [15.1 kB]
Get:26 http://oph.mdrjr.net jessie/backports Translation-en [331 B]
Hit http://ftp.debian.org jessie/main Sources
Hit http://ftp.debian.org jessie/contrib Sources
Get:27 http://oph.mdrjr.net jessie/main Translation-en [326 B]
Hit http://ftp.debian.org jessie/non-free Sources
Hit http://ftp.debian.org jessie/main arm64 Packages
Get:28 http://oph.mdrjr.net all/c2 Translation-en [321 B]
Hit http://ftp.debian.org jessie/contrib arm64 Packages
Hit http://ftp.debian.org jessie/non-free arm64 Packages
Get:29 http://oph.mdrjr.net all/main Translation-en [323 B]
Hit http://ftp.debian.org jessie/contrib Translation-en
Get:30 http://oph.mdrjr.net all/testing Translation-en [326 B]
Hit http://ftp.debian.org jessie/main Translation-en
Hit http://ftp.debian.org jessie/non-free Translation-en
Get:31 http://oph.mdrjr.net jessie/backports Translation-en [331 B]
Get:32 http://oph.mdrjr.net jessie/main Translation-en [326 B]
Get:33 http://oph.mdrjr.net all/c2 Translation-en [321 B]
Get:34 http://oph.mdrjr.net all/main Translation-en [323 B]
Get:35 http://oph.mdrjr.net all/testing Translation-en [326 B]
Get:36 http://oph.mdrjr.net jessie/backports Translation-en [331 B]
Get:37 http://oph.mdrjr.net jessie/main Translation-en [326 B]
Get:38 http://oph.mdrjr.net all/c2 Translation-en [321 B]
Get:39 http://oph.mdrjr.net all/main Translation-en [323 B]
Get:40 http://oph.mdrjr.net all/testing Translation-en [326 B]
Get:41 http://oph.mdrjr.net jessie/backports Translation-en [331 B]
Get:42 http://oph.mdrjr.net jessie/main Translation-en [326 B]
Get:43 http://oph.mdrjr.net all/c2 Translation-en [321 B]
Ign http://oph.mdrjr.net all/c2 Translation-en
Get:44 http://oph.mdrjr.net all/main Translation-en [323 B]
Ign http://oph.mdrjr.net all/main Translation-en
Get:45 http://oph.mdrjr.net all/testing Translation-en [326 B]
Ign http://oph.mdrjr.net all/testing Translation-en
Get:46 http://oph.mdrjr.net jessie/backports Translation-en [331 B]
Ign http://oph.mdrjr.net jessie/backports Translation-en
Get:47 http://oph.mdrjr.net jessie/main Translation-en [326 B]
Ign http://oph.mdrjr.net jessie/main Translation-en
Fetched 352 kB in 9s (37.9 kB/s)
Reading package lists...

Reading package lists...

Building dependency tree...
Reading state information...
bluetooth is already the newest version.
build-essential is already the newest version.
libffi-dev is already the newest version.
libssl-dev is already the newest version.
python-dev is already the newest version.
python-pip is already the newest version.
python-requests is already the newest version.
0 upgraded, 0 newly installed, 0 to remove and 131 not upgraded.
Reading package lists...
Building dependency tree...
Reading state information...
git is already the newest version.
libglib2.0-dev is already the newest version.
0 upgraded, 0 newly installed, 0 to remove and 131 not upgraded.
Requirement already satisfied: pyudev in /usr/local/lib/python3.4/dist-packages
Requirement already satisfied: six in /usr/local/lib/python3.4/dist-packages (from pyudev)
Requirement already satisfied: pyserial in /usr/local/lib/python3.4/dist-packages
Requirement already satisfied: requests in /usr/lib/python3/dist-packages
Collecting cryptography
  Using cached cryptography-2.2.2.tar.gz
    Complete output from command python setup.py egg_info:
    Traceback (most recent call last):
      File "<string>", line 1, in <module>
      File "/tmp/pip-build-nf40qmy1/cryptography/setup.py", line 28, in <module>
        "cryptography requires setuptools 18.5 or newer, please upgrade to a "
    RuntimeError: cryptography requires setuptools 18.5 or newer, please upgrade to a newer version of setuptools
    
    ----------------------------------------
Command "python setup.py egg_info" failed with error code 1 in /tmp/pip-build-nf40qmy1/cryptography/
Collecting pycrypto
  Using cached pycrypto-2.6.1.tar.gz
Installing collected packages: pycrypto
  Running setup.py install for pycrypto: started
    Running setup.py install for pycrypto: still running...
    Running setup.py install for pycrypto: finished with status 'error'
    Complete output from command /usr/bin/python3 -u -c "import setuptools, tokenize;__file__='/tmp/pip-build-vd68tq9d/pycrypto/setup.py';f=getattr(tokenize, 'open', open)(__file__);code=f.read().replace('
', '
');f.close();exec(compile(code, __file__, 'exec'))" install --record /tmp/pip-d9fsi9u2-record/install-record.txt --single-version-externally-managed --compile:
    running install
    running build
    running build_py
    creating build
    creating build/lib.linux-aarch64-3.4
    creating build/lib.linux-aarch64-3.4/Crypto
    copying lib/Crypto/pct_warnings.py -> build/lib.linux-aarch64-3.4/Crypto
    copying lib/Crypto/__init__.py -> build/lib.linux-aarch64-3.4/Crypto
    creating build/lib.linux-aarch64-3.4/Crypto/Hash
    copying lib/Crypto/Hash/MD5.py -> build/lib.linux-aarch64-3.4/Crypto/Hash
    copying lib/Crypto/Hash/SHA256.py -> build/lib.linux-aarch64-3.4/Crypto/Hash
    copying lib/Crypto/Hash/hashalgo.py -> build/lib.linux-aarch64-3.4/Crypto/Hash
    copying lib/Crypto/Hash/SHA512.py -> build/lib.linux-aarch64-3.4/Crypto/Hash
    copying lib/Crypto/Hash/HMAC.py -> build/lib.linux-aarch64-3.4/Crypto/Hash
    copying lib/Crypto/Hash/MD2.py -> build/lib.linux-aarch64-3.4/Crypto/Hash
    copying lib/Crypto/Hash/RIPEMD.py -> build/lib.linux-aarch64-3.4/Crypto/Hash
    copying lib/Crypto/Hash/MD4.py -> build/lib.linux-aarch64-3.4/Crypto/Hash
    copying lib/Crypto/Hash/SHA.py -> build/lib.linux-aarch64-3.4/Crypto/Hash
    copying lib/Crypto/Hash/SHA384.py -> build/lib.linux-aarch64-3.4/Crypto/Hash
    copying lib/Crypto/Hash/SHA224.py -> build/lib.linux-aarch64-3.4/Crypto/Hash
    copying lib/Crypto/Hash/__init__.py -> build/lib.linux-aarch64-3.4/Crypto/Hash
    creating build/lib.linux-aarch64-3.4/Crypto/Cipher
    copying lib/Crypto/Cipher/Blowfish.py -> build/lib.linux-aarch64-3.4/Crypto/Cipher
    copying lib/Crypto/Cipher/DES3.py -> build/lib.linux-aarch64-3.4/Crypto/Cipher
    copying lib/Crypto/Cipher/ARC2.py -> build/lib.linux-aarch64-3.4/Crypto/Cipher
    copying lib/Crypto/Cipher/AES.py -> build/lib.linux-aarch64-3.4/Crypto/Cipher
    copying lib/Crypto/Cipher/blockalgo.py -> build/lib.linux-aarch64-3.4/Crypto/Cipher
    copying lib/Crypto/Cipher/PKCS1_v1_5.py -> build/lib.linux-aarch64-3.4/Crypto/Cipher
    copying lib/Crypto/Cipher/CAST.py -> build/lib.linux-aarch64-3.4/Crypto/Cipher
    copying lib/Crypto/Cipher/XOR.py -> build/lib.linux-aarch64-3.4/Crypto/Cipher
    copying lib/Crypto/Cipher/ARC4.py -> build/lib.linux-aarch64-3.4/Crypto/Cipher
    copying lib/Crypto/Cipher/DES.py -> build/lib.linux-aarch64-3.4/Crypto/Cipher
    copying lib/Crypto/Cipher/__init__.py -> build/lib.linux-aarch64-3.4/Crypto/Cipher
    copying lib/Crypto/Cipher/PKCS1_OAEP.py -> build/lib.linux-aarch64-3.4/Crypto/Cipher
    creating build/lib.linux-aarch64-3.4/Crypto/Util
    copying lib/Crypto/Util/number.py -> build/lib.linux-aarch64-3.4/Crypto/Util
    copying lib/Crypto/Util/py3compat.py -> build/lib.linux-aarch64-3.4/Crypto/Util
    copying lib/Crypto/Util/randpool.py -> build/lib.linux-aarch64-3.4/Crypto/Util
    copying lib/Crypto/Util/RFC1751.py -> build/lib.linux-aarch64-3.4/Crypto/Util
    copying lib/Crypto/Util/Counter.py -> build/lib.linux-aarch64-3.4/Crypto/Util
    copying lib/Crypto/Util/winrandom.py -> build/lib.linux-aarch64-3.4/Crypto/Util
    copying lib/Crypto/Util/_number_new.py -> build/lib.linux-aarch64-3.4/Crypto/Util
    copying lib/Crypto/Util/__init__.py -> build/lib.linux-aarch64-3.4/Crypto/Util
    copying lib/Crypto/Util/asn1.py -> build/lib.linux-aarch64-3.4/Crypto/Util
    creating build/lib.linux-aarch64-3.4/Crypto/Random
    copying lib/Crypto/Random/random.py -> build/lib.linux-aarch64-3.4/Crypto/Random
    copying lib/Crypto/Random/_UserFriendlyRNG.py -> build/lib.linux-aarch64-3.4/Crypto/Random
    copying lib/Crypto/Random/__init__.py -> build/lib.linux-aarch64-3.4/Crypto/Random
    creating build/lib.linux-aarch64-3.4/Crypto/Random/Fortuna
    copying lib/Crypto/Random/Fortuna/FortunaAccumulator.py -> build/lib.linux-aarch64-3.4/Crypto/Random/Fortuna
    copying lib/Crypto/Random/Fortuna/FortunaGenerator.py -> build/lib.linux-aarch64-3.4/Crypto/Random/Fortuna
    copying lib/Crypto/Random/Fortuna/SHAd256.py -> build/lib.linux-aarch64-3.4/Crypto/Random/Fortuna
    copying lib/Crypto/Random/Fortuna/__init__.py -> build/lib.linux-aarch64-3.4/Crypto/Random/Fortuna
    creating build/lib.linux-aarch64-3.4/Crypto/Random/OSRNG
    copying lib/Crypto/Random/OSRNG/rng_base.py -> build/lib.linux-aarch64-3.4/Crypto/Random/OSRNG
    copying lib/Crypto/Random/OSRNG/fallback.py -> build/lib.linux-aarch64-3.4/Crypto/Random/OSRNG
    copying lib/Crypto/Random/OSRNG/__init__.py -> build/lib.linux-aarch64-3.4/Crypto/Random/OSRNG
    copying lib/Crypto/Random/OSRNG/posix.py -> build/lib.linux-aarch64-3.4/Crypto/Random/OSRNG
    creating build/lib.linux-aarch64-3.4/Crypto/SelfTest
    copying lib/Crypto/SelfTest/__init__.py -> build/lib.linux-aarch64-3.4/Crypto/SelfTest
    copying lib/Crypto/SelfTest/st_common.py -> build/lib.linux-aarch64-3.4/Crypto/SelfTest
    creating build/lib.linux-aarch64-3.4/Crypto/SelfTest/Cipher
    copying lib/Crypto/SelfTest/Cipher/test_DES3.py -> build/lib.linux-aarch64-3.4/Crypto/SelfTest/Cipher
    copying lib/Crypto/SelfTest/Cipher/test_CAST.py -> build/lib.linux-aarch64-3.4/Crypto/SelfTest/Cipher
    copying lib/Crypto/SelfTest/Cipher/test_pkcs1_oaep.py -> build/lib.linux-aarch64-3.4/Crypto/SelfTest/Cipher
    copying lib/Crypto/SelfTest/Cipher/common.py -> build/lib.linux-aarch64-3.4/Crypto/SelfTest/Cipher
    copying lib/Crypto/SelfTest/Cipher/test_DES.py -> build/lib.linux-aarch64-3.4/Crypto/SelfTest/Cipher
    copying lib/Crypto/SelfTest/Cipher/test_XOR.py -> build/lib.linux-aarch64-3.4/Crypto/SelfTest/Cipher
    copying lib/Crypto/SelfTest/Cipher/test_Blowfish.py -> build/lib.linux-aarch64-3.4/Crypto/SelfTest/Cipher
    copying lib/Crypto/SelfTest/Cipher/test_ARC2.py -> build/lib.linux-aarch64-3.4/Crypto/SelfTest/Cipher
    copying lib/Crypto/SelfTest/Cipher/test_AES.py -> build/lib.linux-aarch64-3.4/Crypto/SelfTest/Cipher
    copying lib/Crypto/SelfTest/Cipher/test_ARC4.py -> build/lib.linux-aarch64-3.4/Crypto/SelfTest/Cipher
    copying lib/Crypto/SelfTest/Cipher/test_pkcs1_15.py -> build/lib.linux-aarch64-3.4/Crypto/SelfTest/Cipher
    copying lib/Crypto/SelfTest/Cipher/__init__.py -> build/lib.linux-aarch64-3.4/Crypto/SelfTest/Cipher
    creating build/lib.linux-aarch64-3.4/Crypto/SelfTest/Hash
    copying lib/Crypto/SelfTest/Hash/test_SHA512.py -> build/lib.linux-aarch64-3.4/Crypto/SelfTest/Hash
    copying lib/Crypto/SelfTest/Hash/test_SHA224.py -> build/lib.linux-aarch64-3.4/Crypto/SelfTest/Hash
    copying lib/Crypto/SelfTest/Hash/test_MD4.py -> build/lib.linux-aarch64-3.4/Crypto/SelfTest/Hash
    copying lib/Crypto/SelfTest/Hash/common.py -> build/lib.linux-aarch64-3.4/Crypto/SelfTest/Hash
    copying lib/Crypto/SelfTest/Hash/test_SHA.py -> build/lib.linux-aarch64-3.4/Crypto/SelfTest/Hash
    copying lib/Crypto/SelfTest/Hash/test_MD5.py -> build/lib.linux-aarch64-3.4/Crypto/SelfTest/Hash
    copying lib/Crypto/SelfTest/Hash/test_RIPEMD.py -> build/lib.linux-aarch64-3.4/Crypto/SelfTest/Hash
    copying lib/Crypto/SelfTest/Hash/test_SHA384.py -> build/lib.linux-aarch64-3.4/Crypto/SelfTest/Hash
    copying lib/Crypto/SelfTest/Hash/test_HMAC.py -> build/lib.linux-aarch64-3.4/Crypto/SelfTest/Hash
    copying lib/Crypto/SelfTest/Hash/test_MD2.py -> build/lib.linux-aarch64-3.4/Crypto/SelfTest/Hash
    copying lib/Crypto/SelfTest/Hash/__init__.py -> build/lib.linux-aarch64-3.4/Crypto/SelfTest/Hash
    copying lib/Crypto/SelfTest/Hash/test_SHA256.py -> build/lib.linux-aarch64-3.4/Crypto/SelfTest/Hash
    creating build/lib.linux-aarch64-3.4/Crypto/SelfTest/Protocol
    copying lib/Crypto/SelfTest/Protocol/test_AllOrNothing.py -> build/lib.linux-aarch64-3.4/Crypto/SelfTest/Protocol
    copying lib/Crypto/SelfTest/Protocol/test_KDF.py -> build/lib.linux-aarch64-3.4/Crypto/SelfTest/Protocol
    copying lib/Crypto/SelfTest/Protocol/test_chaffing.py -> build/lib.linux-aarch64-3.4/Crypto/SelfTest/Protocol
    copying lib/Crypto/SelfTest/Protocol/test_rfc1751.py -> build/lib.linux-aarch64-3.4/Crypto/SelfTest/Protocol
    copying lib/Crypto/SelfTest/Protocol/__init__.py -> build/lib.linux-aarch64-3.4/Crypto/SelfTest/Protocol
    creating build/lib.linux-aarch64-3.4/Crypto/SelfTest/PublicKey
    copying lib/Crypto/SelfTest/PublicKey/test_importKey.py -> build/lib.linux-aarch64-3.4/Crypto/SelfTest/PublicKey
    copying lib/Crypto/SelfTest/PublicKey/test_RSA.py -> build/lib.linux-aarch64-3.4/Crypto/SelfTest/PublicKey
    copying lib/Crypto/SelfTest/PublicKey/test_DSA.py -> build/lib.linux-aarch64-3.4/Crypto/SelfTest/PublicKey
    copying lib/Crypto/SelfTest/PublicKey/__init__.py -> build/lib.linux-aarch64-3.4/Crypto/SelfTest/PublicKey
    copying lib/Crypto/SelfTest/PublicKey/test_ElGamal.py -> build/lib.linux-aarch64-3.4/Crypto/SelfTest/PublicKey
    creating build/lib.linux-aarch64-3.4/Crypto/SelfTest/Random
    copying lib/Crypto/SelfTest/Random/test__UserFriendlyRNG.py -> build/lib.linux-aarch64-3.4/Crypto/SelfTest/Random
    copying lib/Crypto/SelfTest/Random/test_rpoolcompat.py -> build/lib.linux-aarch64-3.4/Crypto/SelfTest/Random
    copying lib/Crypto/SelfTest/Random/test_random.py -> build/lib.linux-aarch64-3.4/Crypto/SelfTest/Random
    copying lib/Crypto/SelfTest/Random/__init__.py -> build/lib.linux-aarch64-3.4/Crypto/SelfTest/Random
    creating build/lib.linux-aarch64-3.4/Crypto/SelfTest/Random/Fortuna
    copying lib/Crypto/SelfTest/Random/Fortuna/test_SHAd256.py -> build/lib.linux-aarch64-3.4/Crypto/SelfTest/Random/Fortuna
    copying lib/Crypto/SelfTest/Random/Fortuna/test_FortunaGenerator.py -> build/lib.linux-aarch64-3.4/Crypto/SelfTest/Random/Fortuna
    copying lib/Crypto/SelfTest/Random/Fortuna/test_FortunaAccumulator.py -> build/lib.linux-aarch64-3.4/Crypto/SelfTest/Random/Fortuna
    copying lib/Crypto/SelfTest/Random/Fortuna/__init__.py -> build/lib.linux-aarch64-3.4/Crypto/SelfTest/Random/Fortuna
    creating build/lib.linux-aarch64-3.4/Crypto/SelfTest/Random/OSRNG
    copying lib/Crypto/SelfTest/Random/OSRNG/test_posix.py -> build/lib.linux-aarch64-3.4/Crypto/SelfTest/Random/OSRNG
    copying lib/Crypto/SelfTest/Random/OSRNG/test_winrandom.py -> build/lib.linux-aarch64-3.4/Crypto/SelfTest/Random/OSRNG
    copying lib/Crypto/SelfTest/Random/OSRNG/test_fallback.py -> build/lib.linux-aarch64-3.4/Crypto/SelfTest/Random/OSRNG
    copying lib/Crypto/SelfTest/Random/OSRNG/test_nt.py -> build/lib.linux-aarch64-3.4/Crypto/SelfTest/Random/OSRNG
    copying lib/Crypto/SelfTest/Random/OSRNG/test_generic.py -> build/lib.linux-aarch64-3.4/Crypto/SelfTest/Random/OSRNG
    copying lib/Crypto/SelfTest/Random/OSRNG/__init__.py -> build/lib.linux-aarch64-3.4/Crypto/SelfTest/Random/OSRNG
    creating build/lib.linux-aarch64-3.4/Crypto/SelfTest/Util
    copying lib/Crypto/SelfTest/Util/test_Counter.py -> build/lib.linux-aarch64-3.4/Crypto/SelfTest/Util
    copying lib/Crypto/SelfTest/Util/test_winrandom.py -> build/lib.linux-aarch64-3.4/Crypto/SelfTest/Util
    copying lib/Crypto/SelfTest/Util/test_number.py -> build/lib.linux-aarch64-3.4/Crypto/SelfTest/Util
    copying lib/Crypto/SelfTest/Util/test_asn1.py -> build/lib.linux-aarch64-3.4/Crypto/SelfTest/Util
    copying lib/Crypto/SelfTest/Util/__init__.py -> build/lib.linux-aarch64-3.4/Crypto/SelfTest/Util
    creating build/lib.linux-aarch64-3.4/Crypto/SelfTest/Signature
    copying lib/Crypto/SelfTest/Signature/test_pkcs1_pss.py -> build/lib.linux-aarch64-3.4/Crypto/SelfTest/Signature
    copying lib/Crypto/SelfTest/Signature/test_pkcs1_15.py -> build/lib.linux-aarch64-3.4/Crypto/SelfTest/Signature
    copying lib/Crypto/SelfTest/Signature/__init__.py -> build/lib.linux-aarch64-3.4/Crypto/SelfTest/Signature
    creating build/lib.linux-aarch64-3.4/Crypto/Protocol
    copying lib/Crypto/Protocol/AllOrNothing.py -> build/lib.linux-aarch64-3.4/Crypto/Protocol
    copying lib/Crypto/Protocol/Chaffing.py -> build/lib.linux-aarch64-3.4/Crypto/Protocol
    copying lib/Crypto/Protocol/KDF.py -> build/lib.linux-aarch64-3.4/Crypto/Protocol
    copying lib/Crypto/Protocol/__init__.py -> build/lib.linux-aarch64-3.4/Crypto/Protocol
    creating build/lib.linux-aarch64-3.4/Crypto/PublicKey
    copying lib/Crypto/PublicKey/_slowmath.py -> build/lib.linux-aarch64-3.4/Crypto/PublicKey
    copying lib/Crypto/PublicKey/pubkey.py -> build/lib.linux-aarch64-3.4/Crypto/PublicKey
    copying lib/Crypto/PublicKey/RSA.py -> build/lib.linux-aarch64-3.4/Crypto/PublicKey
    copying lib/Crypto/PublicKey/DSA.py -> build/lib.linux-aarch64-3.4/Crypto/PublicKey
    copying lib/Crypto/PublicKey/_DSA.py -> build/lib.linux-aarch64-3.4/Crypto/PublicKey
    copying lib/Crypto/PublicKey/ElGamal.py -> build/lib.linux-aarch64-3.4/Crypto/PublicKey
    copying lib/Crypto/PublicKey/_RSA.py -> build/lib.linux-aarch64-3.4/Crypto/PublicKey
    copying lib/Crypto/PublicKey/__init__.py -> build/lib.linux-aarch64-3.4/Crypto/PublicKey
    creating build/lib.linux-aarch64-3.4/Crypto/Signature
    copying lib/Crypto/Signature/PKCS1_PSS.py -> build/lib.linux-aarch64-3.4/Crypto/Signature
    copying lib/Crypto/Signature/PKCS1_v1_5.py -> build/lib.linux-aarch64-3.4/Crypto/Signature
    copying lib/Crypto/Signature/__init__.py -> build/lib.linux-aarch64-3.4/Crypto/Signature
    Skipping implicit fixer: buffer
    Skipping implicit fixer: idioms
    Skipping implicit fixer: set_literal
    Skipping implicit fixer: ws_comma
    running build_ext
    running build_configure
    checking for gcc... gcc
    checking whether the C compiler works... yes
    checking for C compiler default output file name... a.out
    checking for suffix of executables...
    checking whether we are cross compiling... no
    checking for suffix of object files... o
    checking whether we are using the GNU C compiler... yes
    checking whether gcc accepts -g... yes
    checking for gcc option to accept ISO C89... none needed
    checking for __gmpz_init in -lgmp... no
    checking for __gmpz_init in -lmpir... no
    checking whether mpz_powm is declared... no
    checking whether mpz_powm_sec is declared... no
    checking how to run the C preprocessor... gcc -E
    checking for grep that handles long lines and -e... /bin/grep
    checking for egrep... /bin/grep -E
    checking for ANSI C header files... yes
    checking for sys/types.h... yes
    checking for sys/stat.h... yes
    checking for stdlib.h... yes
    checking for string.h... yes
    checking for memory.h... yes
    checking for strings.h... yes
    checking for inttypes.h... yes
    checking for stdint.h... yes
    checking for unistd.h... yes
    checking for inttypes.h... (cached) yes
    checking limits.h usability... yes
    checking limits.h presence... yes
    checking for limits.h... yes
    checking stddef.h usability... yes
    checking stddef.h presence... yes
    checking for stddef.h... yes
    checking for stdint.h... (cached) yes
    checking for stdlib.h... (cached) yes
    checking for string.h... (cached) yes
    checking wchar.h usability... yes
    checking wchar.h presence... yes
    checking for wchar.h... yes
    checking for inline... inline
    checking for int16_t... yes
    checking for int32_t... yes
    checking for int64_t... yes
    checking for int8_t... yes
    checking for size_t... yes
    checking for uint16_t... yes
    checking for uint32_t... yes
    checking for uint64_t... yes
    checking for uint8_t... yes
    checking for stdlib.h... (cached) yes
    checking for GNU libc compatible malloc... yes
    checking for memmove... yes
    checking for memset... yes
    configure: creating ./config.status
    config.status: creating src/config.h
    warning: GMP or MPIR library not found; Not building Crypto.PublicKey._fastmath.
    building 'Crypto.Hash._MD2' extension
    creating build/temp.linux-aarch64-3.4
    creating build/temp.linux-aarch64-3.4/src
    aarch64-linux-gnu-gcc -pthread -fwrapv -Wall -Wstrict-prototypes -fstack-protector-strong -Wformat -Werror=format-security -D_FORTIFY_SOURCE=2 -fPIC -std=c99 -O3 -fomit-frame-pointer -Isrc/ -I/usr/include/python3.4m -c src/MD2.c -o build/temp.linux-aarch64-3.4/src/MD2.o
    src/MD2.c:31:20: fatal error: Python.h: No such file or directory
     #include "Python.h"
                        ^
    compilation terminated.
    error: command 'aarch64-linux-gnu-gcc' failed with exit status 1
    
    ----------------------------------------
Command "/usr/bin/python3 -u -c "import setuptools, tokenize;__file__='/tmp/pip-build-vd68tq9d/pycrypto/setup.py';f=getattr(tokenize, 'open', open)(__file__);code=f.read().replace('
', '
');f.close();exec(compile(code, __file__, 'exec'))" install --record /tmp/pip-d9fsi9u2-record/install-record.txt --single-version-externally-managed --compile" failed with error code 1 in /tmp/pip-build-vd68tq9d/pycrypto/
Cloning into 'bluepy'...
running build
running build_py
creating build
creating build/lib.linux-aarch64-2.7
creating build/lib.linux-aarch64-2.7/bluepy
copying bluepy/thingy52.py -> build/lib.linux-aarch64-2.7/bluepy
copying bluepy/sensortag.py -> build/lib.linux-aarch64-2.7/bluepy
copying bluepy/scanner.py -> build/lib.linux-aarch64-2.7/bluepy
copying bluepy/get_services.py -> build/lib.linux-aarch64-2.7/bluepy
copying bluepy/btle.py -> build/lib.linux-aarch64-2.7/bluepy
copying bluepy/blescan.py -> build/lib.linux-aarch64-2.7/bluepy
copying bluepy/__init__.py -> build/lib.linux-aarch64-2.7/bluepy
copying bluepy/uuids.json -> build/lib.linux-aarch64-2.7/bluepy
copying bluepy/bluez-src.tgz -> build/lib.linux-aarch64-2.7/bluepy
copying bluepy/bluepy-helper.c -> build/lib.linux-aarch64-2.7/bluepy
copying bluepy/Makefile -> build/lib.linux-aarch64-2.7/bluepy
running install
Working dir is /tmp/bluepy
execute make -C ./bluepy clean
execute make -C bluepy -j1
running build
running build_py
copying bluepy/bluepy-helper -> build/lib.linux-aarch64-2.7/bluepy
running install_lib
copying build/lib.linux-aarch64-2.7/bluepy/bluepy-helper -> /usr/local/lib/python2.7/dist-packages/bluepy
copying build/lib.linux-aarch64-2.7/bluepy/Makefile -> /usr/local/lib/python2.7/dist-packages/bluepy
copying build/lib.linux-aarch64-2.7/bluepy/bluepy-helper.c -> /usr/local/lib/python2.7/dist-packages/bluepy
copying build/lib.linux-aarch64-2.7/bluepy/bluez-src.tgz -> /usr/local/lib/python2.7/dist-packages/bluepy
copying build/lib.linux-aarch64-2.7/bluepy/uuids.json -> /usr/local/lib/python2.7/dist-packages/bluepy
copying build/lib.linux-aarch64-2.7/bluepy/__init__.py -> /usr/local/lib/python2.7/dist-packages/bluepy
copying build/lib.linux-aarch64-2.7/bluepy/blescan.py -> /usr/local/lib/python2.7/dist-packages/bluepy
copying build/lib.linux-aarch64-2.7/bluepy/btle.py -> /usr/local/lib/python2.7/dist-packages/bluepy
copying build/lib.linux-aarch64-2.7/bluepy/get_services.py -> /usr/local/lib/python2.7/dist-packages/bluepy
copying build/lib.linux-aarch64-2.7/bluepy/scanner.py -> /usr/local/lib/python2.7/dist-packages/bluepy
copying build/lib.linux-aarch64-2.7/bluepy/sensortag.py -> /usr/local/lib/python2.7/dist-packages/bluepy
copying build/lib.linux-aarch64-2.7/bluepy/thingy52.py -> /usr/local/lib/python2.7/dist-packages/bluepy
byte-compiling /usr/local/lib/python2.7/dist-packages/bluepy/__init__.py to __init__.pyc
byte-compiling /usr/local/lib/python2.7/dist-packages/bluepy/blescan.py to blescan.pyc
byte-compiling /usr/local/lib/python2.7/dist-packages/bluepy/btle.py to btle.pyc
byte-compiling /usr/local/lib/python2.7/dist-packages/bluepy/get_services.py to get_services.pyc
byte-compiling /usr/local/lib/python2.7/dist-packages/bluepy/scanner.py to scanner.pyc
byte-compiling /usr/local/lib/python2.7/dist-packages/bluepy/sensortag.py to sensortag.pyc
byte-compiling /usr/local/lib/python2.7/dist-packages/bluepy/thingy52.py to thingy52.pyc
running install_egg_info
running egg_info
creating bluepy.egg-info
writing bluepy.egg-info/PKG-INFO
writing top-level names to bluepy.egg-info/top_level.txt
writing dependency_links to bluepy.egg-info/dependency_links.txt
writing entry points to bluepy.egg-info/entry_points.txt
writing manifest file 'bluepy.egg-info/SOURCES.txt'
reading manifest file 'bluepy.egg-info/SOURCES.txt'
writing manifest file 'bluepy.egg-info/SOURCES.txt'
removing '/usr/local/lib/python2.7/dist-packages/bluepy-1.1.2.egg-info' (and everything under it)
Copying bluepy.egg-info to /usr/local/lib/python2.7/dist-packages/bluepy-1.1.2.egg-info
running install_scripts
Installing blescan script to /usr/local/bin
Installing thingy52 script to /usr/local/bin
Installing sensortag script to /usr/local/bin
Everything is successfully installed!
J'ai bien un "Everything is successfully installed!" cependant les dépendances sont toujours en NOK et donc impossible de lancer le démon.

J'ai fait un "apt-get install python3-dev" (je ne sais pas si j'ai bien fait).

Voici mes nouveaux logs, ca semble plutôt bon hormis l'erreur sur "cryptography" (RuntimeError: cryptography requires setuptools 18.5 or newer, please upgrade to a newer version of setuptools) :

Code : Tout sélectionner


Launch install of blea dependancy
Ign http://repo.jeedom.com ./ InRelease
Ign http://ftp.debian.org jessie InRelease
Hit http://security.debian.org jessie/updates InRelease
Ign http://repo.jeedom.com ./ Release.gpg
Hit http://ftp.debian.org jessie-updates InRelease
Hit http://repo.jeedom.com ./ Release
Hit http://ftp.debian.org jessie-backports InRelease
Ign http://repo.jeedom.com ./ Packages/DiffIndex
Hit http://ftp.debian.org jessie-proposed-updates InRelease
Hit http://ftp.debian.org jessie Release.gpg
Hit http://security.debian.org jessie/updates/main Sources
Hit http://ftp.debian.org jessie-updates/main Sources
Hit http://security.debian.org jessie/updates/contrib Sources
Hit http://ftp.debian.org jessie-updates/contrib Sources
Hit http://security.debian.org jessie/updates/non-free Sources
Hit http://ftp.debian.org jessie-updates/non-free Sources
Hit http://security.debian.org jessie/updates/main arm64 Packages
Get:1 http://ftp.debian.org jessie-updates/main arm64 Packages/DiffIndex [10.9 kB]
Hit http://repo.jeedom.com ./ Packages
Hit http://security.debian.org jessie/updates/contrib arm64 Packages
Ign http://repo.jeedom.com ./ Translation-en
Hit http://ftp.debian.org jessie-updates/contrib arm64 Packages
Hit http://security.debian.org jessie/updates/non-free arm64 Packages
Get:2 http://ftp.debian.org jessie-updates/non-free arm64 Packages/DiffIndex [736 B]
Hit http://ftp.debian.org jessie-updates/contrib Translation-en
Hit http://security.debian.org jessie/updates/contrib Translation-en
Get:3 http://ftp.debian.org jessie-updates/main Translation-en/DiffIndex [3688 B]
Hit http://security.debian.org jessie/updates/main Translation-en
Get:4 http://ftp.debian.org jessie-updates/non-free Translation-en/DiffIndex [736 B]
Hit http://security.debian.org jessie/updates/non-free Translation-en
Hit http://ftp.debian.org jessie Release
Get:5 http://ftp.debian.org jessie-backports/main Sources/DiffIndex [27.8 kB]
Hit http://oph.mdrjr.net all InRelease
Get:6 http://ftp.debian.org jessie-backports/contrib Sources/DiffIndex [27.8 kB]
Get:7 http://ftp.debian.org jessie-backports/non-free Sources/DiffIndex [25.3 kB]
Get:8 http://ftp.debian.org jessie-backports/main arm64 Packages/DiffIndex [27.8 kB]
Hit http://oph.mdrjr.net jessie InRelease
Get:9 http://ftp.debian.org jessie-backports/contrib arm64 Packages/DiffIndex [22.9 kB]
Get:10 http://ftp.debian.org jessie-backports/non-free arm64 Packages/DiffIndex [8530 B]
Get:11 http://ftp.debian.org jessie-backports/contrib Translation-en/DiffIndex [7960 B]
Get:12 http://ftp.debian.org jessie-backports/main Translation-en/DiffIndex [27.8 kB]
Hit http://oph.mdrjr.net all/c2 arm64 Packages
Get:13 http://ftp.debian.org jessie-backports/non-free Translation-en/DiffIndex [18.2 kB]
Get:14 http://ftp.debian.org jessie-proposed-updates/contrib Sources/DiffIndex [7762 B]
Get:15 http://ftp.debian.org jessie-proposed-updates/non-free Sources/DiffIndex [15.1 kB]
Hit http://oph.mdrjr.net all/main arm64 Packages
Get:16 http://ftp.debian.org jessie-proposed-updates/main Sources/DiffIndex [27.8 kB]
Hit http://oph.mdrjr.net all/testing arm64 Packages
Get:17 http://ftp.debian.org jessie-proposed-updates/contrib arm64 Packages/DiffIndex [4948 B]
Get:18 http://ftp.debian.org jessie-proposed-updates/non-free arm64 Packages/DiffIndex [7270 B]
Get:19 http://oph.mdrjr.net all/c2 Translation-en [321 B]
Get:20 http://ftp.debian.org jessie-proposed-updates/main arm64 Packages/DiffIndex [27.8 kB]
Get:21 http://oph.mdrjr.net all/main Translation-en [323 B]
Get:22 http://ftp.debian.org jessie-proposed-updates/contrib Translation-en/DiffIndex [8392 B]
Get:23 http://ftp.debian.org jessie-proposed-updates/main Translation-en/DiffIndex [27.8 kB]
Get:24 http://oph.mdrjr.net all/testing Translation-en [326 B]
Get:25 http://ftp.debian.org jessie-proposed-updates/non-free Translation-en/DiffIndex [15.1 kB]
Hit http://oph.mdrjr.net jessie/backports arm64 Packages
Hit http://ftp.debian.org jessie/main Sources
Hit http://ftp.debian.org jessie/contrib Sources
Hit http://oph.mdrjr.net jessie/main arm64 Packages
Hit http://ftp.debian.org jessie/non-free Sources
Hit http://ftp.debian.org jessie/main arm64 Packages
Get:26 http://oph.mdrjr.net jessie/backports Translation-en [331 B]
Hit http://ftp.debian.org jessie/contrib arm64 Packages
Hit http://ftp.debian.org jessie/non-free arm64 Packages
Get:27 http://oph.mdrjr.net jessie/main Translation-en [326 B]
Hit http://ftp.debian.org jessie/contrib Translation-en
Get:28 http://oph.mdrjr.net all/c2 Translation-en [321 B]
Hit http://ftp.debian.org jessie/main Translation-en
Hit http://ftp.debian.org jessie/non-free Translation-en
Get:29 http://oph.mdrjr.net all/main Translation-en [323 B]
Get:30 http://oph.mdrjr.net all/testing Translation-en [326 B]
Get:31 http://oph.mdrjr.net jessie/backports Translation-en [331 B]
Get:32 http://oph.mdrjr.net jessie/main Translation-en [326 B]
Get:33 http://oph.mdrjr.net all/c2 Translation-en [321 B]
Get:34 http://oph.mdrjr.net all/main Translation-en [323 B]
Get:35 http://oph.mdrjr.net all/testing Translation-en [326 B]
Get:36 http://oph.mdrjr.net jessie/backports Translation-en [331 B]
Get:37 http://oph.mdrjr.net jessie/main Translation-en [326 B]
Get:38 http://oph.mdrjr.net all/c2 Translation-en [321 B]
Get:39 http://oph.mdrjr.net all/main Translation-en [323 B]
Get:40 http://oph.mdrjr.net all/testing Translation-en [326 B]
Get:41 http://oph.mdrjr.net jessie/backports Translation-en [331 B]
Get:42 http://oph.mdrjr.net jessie/main Translation-en [326 B]
Get:43 http://oph.mdrjr.net all/c2 Translation-en [321 B]
Ign http://oph.mdrjr.net all/c2 Translation-en
Get:44 http://oph.mdrjr.net all/main Translation-en [323 B]
Ign http://oph.mdrjr.net all/main Translation-en
Get:45 http://oph.mdrjr.net all/testing Translation-en [326 B]
Ign http://oph.mdrjr.net all/testing Translation-en
Get:46 http://oph.mdrjr.net jessie/backports Translation-en [331 B]
Ign http://oph.mdrjr.net jessie/backports Translation-en
Get:47 http://oph.mdrjr.net jessie/main Translation-en [326 B]
Ign http://oph.mdrjr.net jessie/main Translation-en
Fetched 352 kB in 9s (36.0 kB/s)
Reading package lists...

Reading package lists...
Building dependency tree...

Reading state information...
bluetooth is already the newest version.
build-essential is already the newest version.
libffi-dev is already the newest version.
libssl-dev is already the newest version.
python-dev is already the newest version.
python-pip is already the newest version.
python-requests is already the newest version.
0 upgraded, 0 newly installed, 0 to remove and 131 not upgraded.
Reading package lists...
Building dependency tree...

Reading state information...
git is already the newest version.
libglib2.0-dev is already the newest version.
0 upgraded, 0 newly installed, 0 to remove and 131 not upgraded.
Requirement already satisfied: pyudev in /usr/local/lib/python3.4/dist-packages
Requirement already satisfied: six in /usr/local/lib/python3.4/dist-packages (from pyudev)
Requirement already satisfied: pyserial in /usr/local/lib/python3.4/dist-packages
Requirement already satisfied: requests in /usr/lib/python3/dist-packages
Collecting cryptography
  Using cached cryptography-2.2.2.tar.gz
    Complete output from command python setup.py egg_info:
    Traceback (most recent call last):
      File "<string>", line 1, in <module>
      File "/tmp/pip-build-li7352zo/cryptography/setup.py", line 28, in <module>
        "cryptography requires setuptools 18.5 or newer, please upgrade to a "
    RuntimeError: cryptography requires setuptools 18.5 or newer, please upgrade to a newer version of setuptools
    
    ----------------------------------------
Command "python setup.py egg_info" failed with error code 1 in /tmp/pip-build-li7352zo/cryptography/
Collecting pycrypto
  Using cached pycrypto-2.6.1.tar.gz
Installing collected packages: pycrypto
  Running setup.py install for pycrypto: started
    Running setup.py install for pycrypto: still running...
    Running setup.py install for pycrypto: still running...
    Running setup.py install for pycrypto: finished with status 'done'
Successfully installed pycrypto-2.6.1
Cloning into 'bluepy'...
running build
running build_py
creating build
creating build/lib.linux-aarch64-2.7
creating build/lib.linux-aarch64-2.7/bluepy
copying bluepy/thingy52.py -> build/lib.linux-aarch64-2.7/bluepy
copying bluepy/sensortag.py -> build/lib.linux-aarch64-2.7/bluepy
copying bluepy/scanner.py -> build/lib.linux-aarch64-2.7/bluepy
copying bluepy/get_services.py -> build/lib.linux-aarch64-2.7/bluepy
copying bluepy/btle.py -> build/lib.linux-aarch64-2.7/bluepy
copying bluepy/blescan.py -> build/lib.linux-aarch64-2.7/bluepy
copying bluepy/__init__.py -> build/lib.linux-aarch64-2.7/bluepy
copying bluepy/uuids.json -> build/lib.linux-aarch64-2.7/bluepy
copying bluepy/bluez-src.tgz -> build/lib.linux-aarch64-2.7/bluepy
copying bluepy/bluepy-helper.c -> build/lib.linux-aarch64-2.7/bluepy
copying bluepy/Makefile -> build/lib.linux-aarch64-2.7/bluepy
running install
Working dir is /tmp/bluepy
execute make -C ./bluepy clean
execute make -C bluepy -j1
running build
running build_py
copying bluepy/bluepy-helper -> build/lib.linux-aarch64-2.7/bluepy
running install_lib
copying build/lib.linux-aarch64-2.7/bluepy/bluepy-helper -> /usr/local/lib/python2.7/dist-packages/bluepy
copying build/lib.linux-aarch64-2.7/bluepy/Makefile -> /usr/local/lib/python2.7/dist-packages/bluepy
copying build/lib.linux-aarch64-2.7/bluepy/bluepy-helper.c -> /usr/local/lib/python2.7/dist-packages/bluepy
copying build/lib.linux-aarch64-2.7/bluepy/bluez-src.tgz -> /usr/local/lib/python2.7/dist-packages/bluepy
copying build/lib.linux-aarch64-2.7/bluepy/uuids.json -> /usr/local/lib/python2.7/dist-packages/bluepy
copying build/lib.linux-aarch64-2.7/bluepy/__init__.py -> /usr/local/lib/python2.7/dist-packages/bluepy
copying build/lib.linux-aarch64-2.7/bluepy/blescan.py -> /usr/local/lib/python2.7/dist-packages/bluepy
copying build/lib.linux-aarch64-2.7/bluepy/btle.py -> /usr/local/lib/python2.7/dist-packages/bluepy
copying build/lib.linux-aarch64-2.7/bluepy/get_services.py -> /usr/local/lib/python2.7/dist-packages/bluepy
copying build/lib.linux-aarch64-2.7/bluepy/scanner.py -> /usr/local/lib/python2.7/dist-packages/bluepy
copying build/lib.linux-aarch64-2.7/bluepy/sensortag.py -> /usr/local/lib/python2.7/dist-packages/bluepy
copying build/lib.linux-aarch64-2.7/bluepy/thingy52.py -> /usr/local/lib/python2.7/dist-packages/bluepy
byte-compiling /usr/local/lib/python2.7/dist-packages/bluepy/__init__.py to __init__.pyc
byte-compiling /usr/local/lib/python2.7/dist-packages/bluepy/blescan.py to blescan.pyc
byte-compiling /usr/local/lib/python2.7/dist-packages/bluepy/btle.py to btle.pyc
byte-compiling /usr/local/lib/python2.7/dist-packages/bluepy/scanner.py to scanner.pyc
byte-compiling /usr/local/lib/python2.7/dist-packages/bluepy/sensortag.py to sensortag.pyc
byte-compiling /usr/local/lib/python2.7/dist-packages/bluepy/thingy52.py to thingy52.pyc
running install_egg_info
running egg_info
creating bluepy.egg-info
writing bluepy.egg-info/PKG-INFO
writing top-level names to bluepy.egg-info/top_level.txt
writing dependency_links to bluepy.egg-info/dependency_links.txt
writing entry points to bluepy.egg-info/entry_points.txt
writing manifest file 'bluepy.egg-info/SOURCES.txt'
reading manifest file 'bluepy.egg-info/SOURCES.txt'
writing manifest file 'bluepy.egg-info/SOURCES.txt'
removing '/usr/local/lib/python2.7/dist-packages/bluepy-1.1.2.egg-info' (and everything under it)
Copying bluepy.egg-info to /usr/local/lib/python2.7/dist-packages/bluepy-1.1.2.egg-info
running install_scripts
Installing blescan script to /usr/local/bin
Installing thingy52 script to /usr/local/bin
Installing sensortag script to /usr/local/bin
Everything is successfully installed!
D'autres personnes ont rencontré ce problème ?

Merci d'avance.
Jeedom Smart (ZWave+ / RFXCOM / Teleinfo / BLEA / Zigate) / NAS Synology

Avatar de l’utilisateur
mika-nt28
Actif
Messages : 7995
Inscription : 05 août 2014, 08:58
Localisation : Dreux - France

Re: Plugin blea

Message par mika-nt28 » 28 mars 2018, 09:44

J'ai mise a jours le plugin et les dépendance sans problème et le demon a bien redemarré
Pour faciliter la compréhension de votre problème, n’oubliez pas de poster
- Des Screenshots de votre configuration
- Le Log au moment du problème constaté

Encouragez-moi https://www.paypal.me/mikant28

Djal94
Actif
Messages : 1228
Inscription : 09 août 2016, 09:21

Re: Plugin blea

Message par Djal94 » 28 mars 2018, 09:48

Bonjour, je sais pas pour vous, mais cette nuit j'ai de nouveaux mes NUT qui n'ont fait que décrocher....je viens de faire la mise à jour avec réinstallation des dépendances... je vais voir ce que ca donne..
Jeedom 3.2.11 sur NUC Intel (Debian 8)
Zwave - BLEA - Wifi
Trucs et Astuces

Djal94
Actif
Messages : 1228
Inscription : 09 août 2016, 09:21

Re: Plugin blea

Message par Djal94 » 28 mars 2018, 09:53

Bon bah ca continue....depuis le changement d'heure, mes équipements Bluetooth perdent la connexion plusieurs fois par jour, ca n'était jamais arrivé avant...
Jeedom 3.2.11 sur NUC Intel (Debian 8)
Zwave - BLEA - Wifi
Trucs et Astuces

Djal94
Actif
Messages : 1228
Inscription : 09 août 2016, 09:21

Re: Plugin blea

Message par Djal94 » 28 mars 2018, 10:01

J'ai cette erreur dans la log BLEA_Local :

Code : Tout sélectionner

[2018-03-28 09:59:18][INFO] : GLOBAL------Attempt to recover successful, reseting counter
[2018-03-28 09:59:18][INFO] : Starting new HTTP connection (1): 127.0.0.1
[2018-03-28 09:59:19][WARNING] : GLOBAL------Exception on scanner (trying to resolve by myself 6): Failed to execute mgmt cmd 'scanend'
[2018-03-28 09:59:19][INFO] : Starting new HTTP connection (1): 127.0.0.1
[2018-03-28 09:59:19][INFO] : GLOBAL------Attempt to recover successful, reseting counter
[2018-03-28 09:59:19][WARNING] : GLOBAL------Exception on scanner (trying to resolve by myself 6): Failed to execute mgmt cmd 'scanend'
[2018-03-28 09:59:20][INFO] : Starting new HTTP connection (1): 127.0.0.1
[2018-03-28 09:59:20][INFO] : GLOBAL------Attempt to recover successful, reseting counter
[2018-03-28 09:59:20][WARNING] : GLOBAL------Exception on scanner (trying to resolve by myself 6): Failed to execute mgmt cmd 'scanend'
[2018-03-28 09:59:21][INFO] : Starting new HTTP connection (1): 127.0.0.1
[2018-03-28 09:59:21][INFO] : GLOBAL------Attempt to recover successful, reseting counter
[2018-03-28 09:59:26][WARNING] : GLOBAL------Exception on scanner (trying to resolve by myself 6): Failed to execute mgmt cmd 'scanend'
[2018-03-28 09:59:26][INFO] : Starting new HTTP connection (1): 127.0.0.1
[2018-03-28 09:59:26][INFO] : GLOBAL------Attempt to recover successful, reseting counter
[2018-03-28 09:59:27][INFO] : Starting new HTTP connection (1): 127.0.0.1
[2018-03-28 09:59:30][WARNING] : GLOBAL------Exception on scanner (trying to resolve by myself 6): Failed to execute mgmt cmd 'scanend'
[2018-03-28 09:59:30][INFO] : Starting new HTTP connection (1): 127.0.0.1
[2018-03-28 09:59:30][WARNING] : GLOBAL------Exception on scanner (trying to resolve by myself 7): Failed to execute mgmt cmd 'scanend'
[2018-03-28 09:59:30][INFO] : Starting new HTTP connection (1): 127.0.0.1
[2018-03-28 09:59:31][INFO] : GLOBAL------Attempt to recover successful, reseting counter
[2018-03-28 09:59:31][WARNING] : GLOBAL------Exception on scanner (trying to resolve by myself 6): Failed to execute mgmt cmd 'scanend'
[2018-03-28 09:59:32][INFO] : GLOBAL------Attempt to recover successful, reseting counter
[2018-03-28 09:59:32][INFO] : Starting new HTTP connection (1): 127.0.0.1
[2018-03-28 09:59:32][WARNING] : GLOBAL------Exception on scanner (trying to resolve by myself 6): Failed to execute mgmt cmd 'scanend'
[2018-03-28 09:59:33][INFO] : Starting new HTTP connection (1): 127.0.0.1
[2018-03-28 09:59:33][INFO] : GLOBAL------Attempt to recover successful, reseting counter
[2018-03-28 09:59:33][WARNING] : GLOBAL------Exception on scanner (trying to resolve by myself 6): Failed to execute mgmt cmd 'scanend'
[2018-03-28 09:59:34][INFO] : Starting new HTTP connection (1): 127.0.0.1
[2018-03-28 09:59:34][INFO] : GLOBAL------Attempt to recover successful, reseting counter
[2018-03-28 09:59:37][INFO] : Starting new HTTP connection (1): 127.0.0.1
[2018-03-28 09:59:39][INFO] : Starting new HTTP connection (1): 127.0.0.1
[2018-03-28 09:59:42][INFO] : Starting new HTTP connection (1): 127.0.0.1
[2018-03-28 09:59:46][WARNING] : GLOBAL------Exception on scanner (trying to resolve by myself 6): Failed to execute mgmt cmd 'scanend'
[2018-03-28 09:59:46][INFO] : Starting new HTTP connection (1): 127.0.0.1
[2018-03-28 09:59:46][INFO] : GLOBAL------Attempt to recover successful, reseting counter
[2018-03-28 09:59:46][INFO] : Starting new HTTP connection (1): 127.0.0.1
[2018-03-28 09:59:48][INFO] : Starting new HTTP connection (1): 127.0.0.1
[2018-03-28 09:59:52][WARNING] : GLOBAL------Exception on scanner (trying to resolve by myself 6): Failed to execute mgmt cmd 'scanend'
[2018-03-28 09:59:52][INFO] : GLOBAL------Attempt to recover successful, reseting counter
[2018-03-28 09:59:52][INFO] : Starting new HTTP connection (1): 127.0.0.1
[2018-03-28 09:59:57][INFO] : Starting new HTTP connection (1): 127.0.0.1
[2018-03-28 10:00:13][INFO] : Starting new HTTP connection (1): 127.0.0.1
Si quelqu'un à une idée, je suis preneur, merci
Jeedom 3.2.11 sur NUC Intel (Debian 8)
Zwave - BLEA - Wifi
Trucs et Astuces

Zekje
Timide
Messages : 147
Inscription : 19 déc. 2016, 20:27
Contact :

Re: Plugin blea

Message par Zekje » 28 mars 2018, 10:07

@bertrandf
pour le soucis sur cryptography, as tu essayé a la main --upgrade sur la ligne du pip install ? et installe aussi setuptools ça aide :)
-> Zekje

bertrandF
Timide
Messages : 63
Inscription : 23 déc. 2015, 14:50

Re: Plugin blea

Message par bertrandF » 28 mars 2018, 10:47

Zekje a écrit :
28 mars 2018, 10:07
@bertrandf
pour le soucis sur cryptography, as tu essayé a la main --upgrade sur la ligne du pip install ? et installe aussi setuptools ça aide :)
Oui j'avais regardé la version de setuptools :

Code : Tout sélectionner

# apt-cache policy python3-setuptools
python3-setuptools:
  Installed: 5.5.1-1
  Candidate: 5.5.1-1
  Version table:
     33.1.1-1~bpo8+1 0
        100 http://ftp.debian.org/debian/ jessie-backports/main arm64 Packages
 *** 5.5.1-1 0
        500 http://ftp.debian.org/debian/ jessie/main arm64 Packages
        100 /var/lib/dpkg/status
Du coup, j'ai fait un :

Code : Tout sélectionner

# apt-get -t jessie-backports install python3-setuptools
J'ai relancé les dépendances, je n'ai plus d'erreur mais pour l'instant je n'arrive pas encore à "Everything is successfully installed!", ca fait 10mins qu'il est sur "Installing sensortag script to /usr/local/bin".
Jeedom Smart (ZWave+ / RFXCOM / Teleinfo / BLEA / Zigate) / NAS Synology

squwal
Timide
Messages : 60
Inscription : 25 mai 2017, 17:15

Re: Plugin blea

Message par squwal » 28 mars 2018, 10:59

@Djal94
Ah effectivement je pensais que c'était plutôt lié à ma charge mais j'ai un peu le même problème que toi. Parti en vrille au changement d'heures, et depuis des décrochages alors qu'avant c'était parfaitement stable.

Je ne peux pas ajouter mes logs je les avais coupé il y a peu vu que justement c'était bien stable.

bertrandF
Timide
Messages : 63
Inscription : 23 déc. 2015, 14:50

Re: Plugin blea

Message par bertrandF » 28 mars 2018, 11:30

Suite de mon histoire, les dépendances s’installent correctement mais sont toujours marquées en NOK.

Je pense que je n'aurais pas du faire un

Code : Tout sélectionner

apt-get -t jessie-backports install python3-setuptools
Depuis ma plateforme est complétement instable, RFXCom et Zigate ne fonctionnent plus :oops:

EDIT: j'ai restauré une sauvegarde et j'ai fait un reboot, tout refonctionne à nouveau mais j'ai toujours mon problème avec le plugin BLEA.
Les logs de l'installation des dépendances :

Code : Tout sélectionner

Launch install of blea dependancy
Ign http://repo.jeedom.com ./ InRelease
Ign http://repo.jeedom.com ./ Release.gpg
Get:1 http://security.debian.org jessie/updates InRelease [63.1 kB]
Ign http://ftp.debian.org jessie InRelease
Hit http://repo.jeedom.com ./ Release
Ign http://repo.jeedom.com ./ Packages/DiffIndex
Get:2 http://ftp.debian.org jessie-updates InRelease [145 kB]
Get:3 http://security.debian.org jessie/updates/main Sources [217 kB]
Get:4 http://ftp.debian.org jessie-backports InRelease [166 kB]
Hit http://repo.jeedom.com ./ Packages
Ign http://repo.jeedom.com ./ Translation-en
Get:5 http://ftp.debian.org jessie-proposed-updates InRelease [132 kB]
Hit http://security.debian.org jessie/updates/contrib Sources
Hit http://security.debian.org jessie/updates/non-free Sources
Get:6 http://security.debian.org jessie/updates/main arm64 Packages [462 kB]
Hit http://ftp.debian.org jessie Release.gpg
Hit http://ftp.debian.org jessie-updates/main Sources
Hit http://ftp.debian.org jessie-updates/contrib Sources
Hit http://ftp.debian.org jessie-updates/non-free Sources
Get:7 http://ftp.debian.org jessie-updates/main arm64 Packages/DiffIndex [10.9 kB]
Hit http://ftp.debian.org jessie-updates/contrib arm64 Packages
Get:8 http://ftp.debian.org jessie-updates/non-free arm64 Packages/DiffIndex [736 B]
Hit http://ftp.debian.org jessie-updates/contrib Translation-en
Get:9 http://ftp.debian.org jessie-updates/main Translation-en/DiffIndex [3688 B]
Get:10 http://ftp.debian.org jessie-updates/non-free Translation-en/DiffIndex [736 B]
Hit http://oph.mdrjr.net all InRelease
Get:11 http://ftp.debian.org jessie-backports/main Sources/DiffIndex [27.8 kB]
Hit http://oph.mdrjr.net jessie InRelease
Get:12 http://ftp.debian.org jessie-backports/contrib Sources/DiffIndex [27.8 kB]
Get:13 http://ftp.debian.org jessie-backports/non-free Sources/DiffIndex [25.3 kB]
Hit http://oph.mdrjr.net all/c2 arm64 Packages
Get:14 http://ftp.debian.org jessie-backports/main arm64 Packages/DiffIndex [27.8 kB]
Hit http://oph.mdrjr.net all/main arm64 Packages
Hit http://security.debian.org jessie/updates/contrib arm64 Packages
Hit http://security.debian.org jessie/updates/non-free arm64 Packages
Hit http://security.debian.org jessie/updates/contrib Translation-en
Get:15 http://security.debian.org jessie/updates/main Translation-en [258 kB]
Hit http://oph.mdrjr.net all/testing arm64 Packages
Get:16 http://ftp.debian.org jessie-backports/contrib arm64 Packages/DiffIndex [22.9 kB]
Get:17 http://ftp.debian.org jessie-backports/non-free arm64 Packages/DiffIndex [8530 B]
Get:18 http://ftp.debian.org jessie-backports/contrib Translation-en/DiffIndex [7960 B]
Get:19 http://ftp.debian.org jessie-backports/main Translation-en/DiffIndex [27.8 kB]
Get:20 http://oph.mdrjr.net all/c2 Translation-en [321 B]
Get:21 http://oph.mdrjr.net all/main Translation-en [323 B]
Get:22 http://ftp.debian.org jessie-backports/non-free Translation-en/DiffIndex [18.2 kB]
Get:23 http://oph.mdrjr.net all/testing Translation-en [326 B]
Hit http://ftp.debian.org jessie Release
Get:24 http://ftp.debian.org jessie-proposed-updates/contrib Sources/DiffIndex [7762 B]
Hit http://oph.mdrjr.net jessie/backports arm64 Packages
Hit http://security.debian.org jessie/updates/non-free Translation-en
Get:25 http://ftp.debian.org jessie-proposed-updates/non-free Sources/DiffIndex [15.1 kB]
Get:26 http://ftp.debian.org jessie-proposed-updates/main Sources/DiffIndex [27.8 kB]
Hit http://oph.mdrjr.net jessie/main arm64 Packages
Get:27 http://ftp.debian.org jessie-proposed-updates/contrib arm64 Packages/DiffIndex [4948 B]
Get:28 http://oph.mdrjr.net jessie/backports Translation-en [331 B]
Get:29 http://ftp.debian.org jessie-proposed-updates/non-free arm64 Packages/DiffIndex [7270 B]
Get:30 http://ftp.debian.org jessie-proposed-updates/main arm64 Packages/DiffIndex [27.8 kB]
Get:31 http://oph.mdrjr.net jessie/main Translation-en [326 B]
Get:32 http://ftp.debian.org jessie-proposed-updates/contrib Translation-en/DiffIndex [8392 B]
Get:33 http://oph.mdrjr.net all/c2 Translation-en [321 B]
Get:34 http://ftp.debian.org jessie-proposed-updates/main Translation-en/DiffIndex [27.8 kB]
Get:35 http://ftp.debian.org jessie-proposed-updates/non-free Translation-en/DiffIndex [15.1 kB]
Hit http://ftp.debian.org jessie/main Sources
Get:36 http://oph.mdrjr.net all/main Translation-en [323 B]
Hit http://ftp.debian.org jessie/contrib Sources
Hit http://ftp.debian.org jessie/non-free Sources
Hit http://ftp.debian.org jessie/main arm64 Packages
Get:37 http://oph.mdrjr.net all/testing Translation-en [326 B]
Hit http://ftp.debian.org jessie/contrib arm64 Packages
Hit http://ftp.debian.org jessie/non-free arm64 Packages
Hit http://ftp.debian.org jessie/contrib Translation-en
Get:38 http://oph.mdrjr.net jessie/backports Translation-en [331 B]
Hit http://ftp.debian.org jessie/main Translation-en
Get:39 http://oph.mdrjr.net jessie/main Translation-en [326 B]
Hit http://ftp.debian.org jessie/non-free Translation-en
Get:40 http://oph.mdrjr.net all/c2 Translation-en [321 B]
Get:41 http://oph.mdrjr.net all/main Translation-en [323 B]
Get:42 http://oph.mdrjr.net all/testing Translation-en [326 B]
Get:43 http://oph.mdrjr.net jessie/backports Translation-en [331 B]
Get:44 http://oph.mdrjr.net jessie/main Translation-en [326 B]
Get:45 http://oph.mdrjr.net all/c2 Translation-en [321 B]
Get:46 http://oph.mdrjr.net all/main Translation-en [323 B]
Get:47 http://oph.mdrjr.net all/testing Translation-en [326 B]
Get:48 http://oph.mdrjr.net jessie/backports Translation-en [331 B]
Get:49 http://oph.mdrjr.net jessie/main Translation-en [326 B]
Get:50 http://oph.mdrjr.net all/c2 Translation-en [321 B]
Ign http://oph.mdrjr.net all/c2 Translation-en
Get:51 http://oph.mdrjr.net all/main Translation-en [323 B]
Ign http://oph.mdrjr.net all/main Translation-en
Get:52 http://oph.mdrjr.net all/testing Translation-en [326 B]
Ign http://oph.mdrjr.net all/testing Translation-en
Get:53 http://oph.mdrjr.net jessie/backports Translation-en [331 B]
Ign http://oph.mdrjr.net jessie/backports Translation-en
Get:54 http://oph.mdrjr.net jessie/main Translation-en [326 B]
Ign http://oph.mdrjr.net jessie/main Translation-en
Fetched 1796 kB in 10s (166 kB/s)
Reading package lists...

Reading package lists...
Building dependency tree...
Reading state information...
bluetooth is already the newest version.
build-essential is already the newest version.
libffi-dev is already the newest version.
libssl-dev is already the newest version.
python-dev is already the newest version.
python-pip is already the newest version.
python-requests is already the newest version.
0 upgraded, 0 newly installed, 0 to remove and 131 not upgraded.
Reading package lists...
Building dependency tree...
Reading state information...
git is already the newest version.
libglib2.0-dev is already the newest version.
0 upgraded, 0 newly installed, 0 to remove and 131 not upgraded.
Requirement already satisfied: pyudev in /usr/local/lib/python3.4/dist-packages
Requirement already satisfied: six in /usr/local/lib/python3.4/dist-packages (from pyudev)
Requirement already satisfied: pyserial in /usr/local/lib/python3.4/dist-packages
Requirement already satisfied: requests in /usr/lib/python3/dist-packages
Requirement already satisfied: cryptography in /usr/local/lib/python3.4/dist-packages
Requirement already satisfied: asn1crypto>=0.21.0 in /usr/local/lib/python3.4/dist-packages (from cryptography)
Requirement already satisfied: idna>=2.1 in /usr/local/lib/python3.4/dist-packages (from cryptography)
Requirement already satisfied: six>=1.4.1 in /usr/local/lib/python3.4/dist-packages (from cryptography)
Requirement already satisfied: cffi>=1.7 in /usr/local/lib/python3.4/dist-packages (from cryptography)
Requirement already satisfied: pycparser in /usr/local/lib/python3.4/dist-packages (from cffi>=1.7->cryptography)
Requirement already satisfied: pycrypto in /usr/local/lib/python3.4/dist-packages
Cloning into 'bluepy'...
running build
running build_py
creating build
creating build/lib.linux-aarch64-2.7
creating build/lib.linux-aarch64-2.7/bluepy
copying bluepy/thingy52.py -> build/lib.linux-aarch64-2.7/bluepy
copying bluepy/sensortag.py -> build/lib.linux-aarch64-2.7/bluepy
copying bluepy/scanner.py -> build/lib.linux-aarch64-2.7/bluepy
copying bluepy/get_services.py -> build/lib.linux-aarch64-2.7/bluepy
copying bluepy/btle.py -> build/lib.linux-aarch64-2.7/bluepy
copying bluepy/blescan.py -> build/lib.linux-aarch64-2.7/bluepy
copying bluepy/__init__.py -> build/lib.linux-aarch64-2.7/bluepy
copying bluepy/uuids.json -> build/lib.linux-aarch64-2.7/bluepy
copying bluepy/bluez-src.tgz -> build/lib.linux-aarch64-2.7/bluepy
copying bluepy/bluepy-helper.c -> build/lib.linux-aarch64-2.7/bluepy
copying bluepy/Makefile -> build/lib.linux-aarch64-2.7/bluepy
running install
Working dir is /tmp/bluepy
execute make -C ./bluepy clean
execute make -C bluepy -j1
running build
running build_py
copying bluepy/bluepy-helper -> build/lib.linux-aarch64-2.7/bluepy
running install_lib
copying build/lib.linux-aarch64-2.7/bluepy/bluepy-helper -> /usr/local/lib/python2.7/dist-packages/bluepy
copying build/lib.linux-aarch64-2.7/bluepy/Makefile -> /usr/local/lib/python2.7/dist-packages/bluepy
copying build/lib.linux-aarch64-2.7/bluepy/bluepy-helper.c -> /usr/local/lib/python2.7/dist-packages/bluepy
copying build/lib.linux-aarch64-2.7/bluepy/bluez-src.tgz -> /usr/local/lib/python2.7/dist-packages/bluepy
copying build/lib.linux-aarch64-2.7/bluepy/uuids.json -> /usr/local/lib/python2.7/dist-packages/bluepy
copying build/lib.linux-aarch64-2.7/bluepy/__init__.py -> /usr/local/lib/python2.7/dist-packages/bluepy
copying build/lib.linux-aarch64-2.7/bluepy/blescan.py -> /usr/local/lib/python2.7/dist-packages/bluepy
copying build/lib.linux-aarch64-2.7/bluepy/btle.py -> /usr/local/lib/python2.7/dist-packages/bluepy
copying build/lib.linux-aarch64-2.7/bluepy/get_services.py -> /usr/local/lib/python2.7/dist-packages/bluepy
copying build/lib.linux-aarch64-2.7/bluepy/scanner.py -> /usr/local/lib/python2.7/dist-packages/bluepy
copying build/lib.linux-aarch64-2.7/bluepy/sensortag.py -> /usr/local/lib/python2.7/dist-packages/bluepy
copying build/lib.linux-aarch64-2.7/bluepy/thingy52.py -> /usr/local/lib/python2.7/dist-packages/bluepy
byte-compiling /usr/local/lib/python2.7/dist-packages/bluepy/__init__.py to __init__.pyc
byte-compiling /usr/local/lib/python2.7/dist-packages/bluepy/blescan.py to blescan.pyc
byte-compiling /usr/local/lib/python2.7/dist-packages/bluepy/btle.py to btle.pyc
byte-compiling /usr/local/lib/python2.7/dist-packages/bluepy/get_services.py to get_services.pyc
byte-compiling /usr/local/lib/python2.7/dist-packages/bluepy/scanner.py to scanner.pyc
byte-compiling /usr/local/lib/python2.7/dist-packages/bluepy/sensortag.py to sensortag.pyc
byte-compiling /usr/local/lib/python2.7/dist-packages/bluepy/thingy52.py to thingy52.pyc
running install_egg_info
running egg_info
creating bluepy.egg-info
writing bluepy.egg-info/PKG-INFO
writing top-level names to bluepy.egg-info/top_level.txt
writing dependency_links to bluepy.egg-info/dependency_links.txt
writing entry points to bluepy.egg-info/entry_points.txt
writing manifest file 'bluepy.egg-info/SOURCES.txt'
reading manifest file 'bluepy.egg-info/SOURCES.txt'
writing manifest file 'bluepy.egg-info/SOURCES.txt'
removing '/usr/local/lib/python2.7/dist-packages/bluepy-1.1.2.egg-info' (and everything under it)
Copying bluepy.egg-info to /usr/local/lib/python2.7/dist-packages/bluepy-1.1.2.egg-info
running install_scripts
Installing blescan script to /usr/local/bin
Installing thingy52 script to /usr/local/bin
Installing sensortag script to /usr/local/bin
Everything is successfully installed!
Ca semble tout bon et pourtant les dépendances sont en NOK et impossible de lancer le démon.
Jeedom Smart (ZWave+ / RFXCOM / Teleinfo / BLEA / Zigate) / NAS Synology

Viald
Actif
Messages : 634
Inscription : 21 juil. 2014, 00:09

Re: Plugin blea

Message par Viald » 28 mars 2018, 12:28

squwal a écrit :
28 mars 2018, 10:59
@Djal94
Ah effectivement je pensais que c'était plutôt lié à ma charge mais j'ai un peu le même problème que toi. Parti en vrille au changement d'heures, et depuis des décrochages alors qu'avant c'était parfaitement stable.

Je ne peux pas ajouter mes logs je les avais coupé il y a peu vu que justement c'était bien stable.
J'ai le même problème si je passe la gestion de la répétition des valeurs (dans configuration avancée) de la commande Present à "Jamais répéter". Dans cette conf, ca décroche à tour de bras alors que le signal est toujours à -44db.
En mode automatique je n'ai plus de décrochage par contre, les scénarios qui ont comme déclencheur la commande Present du Nut sont exécutés toutes les secondes quand le Nut est présent...
Jeedom 3.3.x / Odroid N2 [Alcatel OneTouch X220L + Milight + Aeotec Z-Stick S5 + Bluetooth + RFXCom]

bertrandF
Timide
Messages : 63
Inscription : 23 déc. 2015, 14:50

Re: Plugin blea

Message par bertrandF » 28 mars 2018, 12:31

Est-ce que chez vous aussi, le temps d'installation des dépendances se base sur la date de "Dernière installation" ?
Je me retrouve avec ce genre d'affichage :
blea_02.png
blea_02.png (22.37 Kio) Consulté 796 fois
Est-ce que ca pourrait être l'explication de mon problème ? Il estime que les dépendances ont mis trop de temps à s'installer et donc il passe en NOK même si les logs disent que tout s'est bien passé ?
Jeedom Smart (ZWave+ / RFXCOM / Teleinfo / BLEA / Zigate) / NAS Synology

Répondre

Revenir vers « [Plugin Officiel] BLEA »

Qui est en ligne ?

Utilisateurs parcourant ce forum : Aucun utilisateur inscrit et 2 invités